program: Orca
programVersion: 5.0.2
elementType: S P O O O N N C C C C C C C C C C C C C H H H H H H H H H H H H H H H H H H H H H H H
charge: 0
multiplicity: 1
keywords: wb97x-d3
keywords: def2-TZVPP
keywords: def2/J RIJCOSX
keywords: DEFGRID2
keywords: scfconv7
keywords: smallprint printgap noloewdin
keywords: NOSOSCF
formula: C13H23N2O3PS
InChI: InChI=1/C13H23N2O3PS/c1-7-16-19(20,17-10(2)3)18-11-8-14-12(15-9-11)13(4,5)6/h8-10H,7H2,1-6H3
43 atoms
S  1.895801 0.209478 1.897915
P  1.772785 0.651417 0.031496
O  2.777506 1.700053 -0.599364
O  0.430522 1.468197 -0.402382
O  1.771019 -0.584339 -0.972656
N  -2.575337 -0.353756 -1.222591
N  -2.642555 0.232249 1.053419
C  -4.505974 -1.032237 0.081188
C  -5.492092 -0.304264 -0.840114
C  -5.049244 -1.006546 1.506623
C  -4.360623 -2.489903 -0.368954
C  -3.158406 -0.345766 -0.023806
C  4.22911 1.703414 -0.437228
C  -0.787166 0.845243 -0.264745
C  -1.394845 0.226453 -1.342738
C  -1.464024 0.82985 0.936765
C  4.602527 2.477685 0.807709
C  4.835339 0.31599 -0.484804
C  1.856366 -1.970438 -0.569762
C  0.492434 -2.572969 -0.352545
H  -6.475062 -0.775205 -0.782546
H  -5.171166 -0.330558 -1.881227
H  -5.607725 0.741592 -0.548292
H  -4.393684 -1.525281 2.206606
H  -5.197808 0.008639 1.874276
H  -6.017724 -1.509054 1.52997
H  -5.325282 -2.996206 -0.301216
H  -3.656378 -3.033119 0.264614
H  -4.016082 -2.567087 -1.399699
H  4.562161 2.256918 -1.315394
H  -0.920972 0.213764 -2.318617
H  -1.057685 1.314851 1.816636
H  4.314078 1.950672 1.716698
H  5.68353 2.619995 0.828262
H  4.138966 3.464437 0.812421
H  4.559681 -0.22155 -1.391852
H  4.568415 -0.288262 0.383667
H  5.92088 0.41812 -0.486116
H  2.380232 -2.468676 -1.383591
H  2.47025 -2.054895 0.327705
H  -0.121445 -2.514521 -1.250808
H  0.612419 -3.627532 -0.100669
H  -0.039146 -2.092563 0.46994
elementType: S P O N C H
totalener: -1584.18162018 hartree
nucrepener: 2034.71805560 hartree
electener: -3618.89967577 hartree
oneelecener: -6218.62847579 hartree
twoeener: 2599.72880002 hartree
cpcmener: -0.02222529 hartree
kineticenergy: 1578.91454686 hartree
xcener: -118.043318386859 hartree
chargesum: -0.0000000
charge: -0.443800 0.739647 -0.349625 -0.360187 -0.347448 -0.386252 -0.347260 0.302086 -0.339778 -0.326882 -0.340376 0.244750 0.169559 0.225805 -0.023158 -0.002935 -0.271242 -0.287814 0.060897 -0.256299 0.097530 0.095288 0.104513 0.094563 0.091867 0.099883 0.098383 0.103288 0.094847 0.090789 0.147373 0.135141 0.086129 0.100860 0.099736 0.108657 0.087541 0.111039 0.113107 0.096400 0.092876 0.112687 0.077815
qa: -0.4438 0.7396 -0.3496 -0.3602 -0.3474 -0.3863 -0.3473 0.3021 -0.3398 -0.3269 -0.3404 0.2447 0.1696 0.2258 -0.0232 -0.0029 -0.2712 -0.2878 0.0609 -0.2563 0.0975 0.0953 0.1045 0.0946 0.0919 0.0999 0.0984 0.1033 0.0948 0.0908 0.1474 0.1351 0.0861 0.1009 0.0997 0.1087 0.0875 0.1110 0.1131 0.0964 0.0929 0.1127 0.0778
va: 1.9690 5.5229 2.1271 2.1052 2.0719 3.0320 3.0748 3.6158 3.9318 3.9288 3.9292 3.9630 3.8354 3.7200 4.0930 4.0990 3.9348 3.8925 3.8017 3.9431 1.0030 1.0170 1.0025 1.0109 1.0129 1.0026 1.0033 1.0023 1.0182 0.9922 1.0093 1.0166 1.0159 1.0067 1.0079 1.0074 1.0167 1.0068 0.9913 1.0095 1.0039 1.0091 1.0073
dispcorr: -0.022957010 hartree
energy: -1584.204577185968
dipole: -9.25014 10.84849 1.59835 -13.63916 12.89226 -0.74690 -1.68003 0.63714 -1.04289
magnitude: 2.04944 au
magnitude: 5.20927 debye
