program: Orca
programVersion: 5.0.2
elementType: S P O O O N N C C C C C C C C C C C C C H H H H H H H H H H H H H H H H H H H H H H H
charge: 0
multiplicity: 1
keywords: wb97x-d3
keywords: def2-TZVPP
keywords: def2/J RIJCOSX
keywords: DEFGRID2
keywords: scfconv7
keywords: smallprint printgap noloewdin
keywords: NOSOSCF
formula: C13H23N2O3PS
InChI: InChI=1/C13H23N2O3PS/c1-7-16-19(20,17-10(2)3)18-11-8-14-12(15-9-11)13(4,5)6/h8-10H,7H2,1-6H3
43 atoms
S  1.663029 0.25935 1.901542
P  1.931257 -0.062855 0.030245
O  3.115091 0.70449 -0.692227
O  0.68598 0.339726 -0.935761
O  2.141269 -1.565472 -0.43921
N  -2.852244 0.920623 -0.833825
N  -2.415919 -1.079594 0.309825
C  -4.722092 -0.346409 0.132401
C  -4.938801 -0.249535 1.647398
C  -5.148537 -1.735334 -0.354235
C  -5.582122 0.704766 -0.562343
C  -3.246257 -0.149339 -0.154814
C  3.585178 2.021556 -0.282281
C  -0.630098 0.144221 -0.623769
C  -1.555116 1.070907 -1.060519
C  -1.122488 -0.945423 0.076623
C  4.922665 2.217036 -0.955892
C  2.575748 3.085724 -0.653588
C  3.008797 -2.488046 0.256849
C  2.287631 -3.799393 0.42282
H  -4.654355 0.73315 2.028462
H  -4.3627 -1.001279 2.186945
H  -5.992846 -0.405371 1.884793
H  -4.604112 -2.530087 0.154063
H  -6.212106 -1.884999 -0.16105
H  -4.987206 -1.848111 -1.428057
H  -5.35357 1.71577 -0.226347
H  -6.633116 0.514474 -0.338211
H  -5.467937 0.676102 -1.646477
H  3.720668 2.001909 0.802117
H  -1.239765 1.948863 -1.613978
H  -0.47715 -1.732833 0.448806
H  4.823487 2.245286 -2.041864
H  5.35219 3.164844 -0.632874
H  5.623838 1.426536 -0.688542
H  1.636327 2.968789 -0.112083
H  2.366797 3.079776 -1.723964
H  2.97731 4.065426 -0.394425
H  3.912494 -2.599304 -0.341695
H  3.293802 -2.079204 1.228161
H  2.950467 -4.512969 0.911968
H  1.398238 -3.686411 1.043402
H  1.993995 -4.221562 -0.538134
elementType: S P O N C H
totalener: -1584.18559600 hartree
nucrepener: 1989.98689248 hartree
electener: -3574.17248848 hartree
oneelecener: -6129.15733045 hartree
twoeener: 2554.98484197 hartree
cpcmener: -0.02226741 hartree
kineticenergy: 1578.92239450 hartree
xcener: -118.041261248203 hartree
chargesum: 0.0000000
charge: -0.442275 0.748222 -0.349866 -0.330616 -0.346547 -0.355030 -0.398037 0.293345 -0.340136 -0.337702 -0.324848 0.249275 0.140182 0.236453 -0.000162 0.010787 -0.249665 -0.242278 0.046149 -0.245270 0.104465 0.095281 0.097799 0.093039 0.096681 0.103919 0.090668 0.099092 0.095108 0.076054 0.138856 0.117658 0.090873 0.091483 0.097591 0.083068 0.094241 0.101989 0.108492 0.084300 0.097938 0.086503 0.092921
qa: -0.4423 0.7482 -0.3499 -0.3306 -0.3465 -0.3550 -0.3980 0.2933 -0.3401 -0.3377 -0.3248 0.2493 0.1402 0.2365 -0.0002 0.0108 -0.2497 -0.2423 0.0461 -0.2453 0.1045 0.0953 0.0978 0.0930 0.0967 0.1039 0.0907 0.0991 0.0951 0.0761 0.1389 0.1177 0.0909 0.0915 0.0976 0.0831 0.0942 0.1020 0.1085 0.0843 0.0979 0.0865 0.0929
va: 1.9783 5.5038 2.1350 2.1207 2.1041 3.0787 3.0662 3.6229 3.9323 3.9289 3.9273 3.9585 3.8352 3.7072 4.0809 4.0899 3.9331 3.8771 3.8435 3.9309 1.0026 1.0158 1.0025 1.0196 1.0033 1.0026 1.0134 1.0027 1.0105 1.0195 1.0076 1.0241 1.0065 1.0048 1.0086 1.0210 1.0091 1.0080 0.9973 1.0120 1.0085 1.0050 1.0042
dispcorr: -0.020374981 hartree
energy: -1584.205970978091
dipole: -10.87316 12.61816 1.74501 -1.03150 1.00133 -0.03017 -0.90989 0.38543 -0.52445
magnitude: 1.82236 au
magnitude: 4.63208 debye
