program: Orca
programVersion: 5.0.2
elementType: S P O O O N N C C C C C C C C C C C C C H H H H H H H H H H H H H H H H H H H H H H H
charge: 0
multiplicity: 1
keywords: wb97x-d3
keywords: def2-TZVPP
keywords: def2/J RIJCOSX
keywords: DEFGRID2
keywords: scfconv7
keywords: smallprint printgap noloewdin
keywords: NOSOSCF
formula: C13H23N2O3PS
InChI: InChI=1/C13H23N2O3PS/c1-7-16-19(20,17-10(2)3)18-11-8-14-12(15-9-11)13(4,5)6/h8-10H,7H2,1-6H3
43 atoms
S  3.508162 -0.416309 1.604553
P  2.038505 0.110743 0.496571
O  2.098641 1.550226 -0.171886
O  0.661345 0.237888 1.348965
O  1.668713 -0.82818 -0.737746
N  -2.767209 -0.785191 1.093266
N  -2.310255 0.64131 -0.713687
C  -4.554367 -0.322338 -0.485633
C  -4.710602 -1.778605 -0.94263
C  -4.896295 0.602675 -1.650751
C  -5.518451 -0.041009 0.672107
C  -3.126899 -0.131517 -0.012245
C  3.324522 2.133601 -0.700769
C  -0.605626 0.131199 0.834008
C  -1.521539 -0.659098 1.509084
C  -1.056998 0.77988 -0.297674
C  3.784427 1.395358 -1.939279
C  3.010311 3.586843 -0.968551
C  1.889199 -2.256537 -0.732425
C  0.874402 -2.997436 0.101502
H  -4.030278 -2.011586 -1.764053
H  -5.728871 -1.953762 -1.294925
H  -4.513408 -2.480173 -0.131725
H  -4.79402 1.654948 -1.382532
H  -4.271785 0.416705 -2.524119
H  -5.933605 0.439213 -1.94784
H  -6.549282 -0.156848 0.332869
H  -5.405811 0.978944 1.044979
H  -5.366066 -0.723569 1.507177
H  4.085664 2.059383 0.080302
H  -1.232103 -1.192963 2.408358
H  -0.41769 1.428119 -0.885871
H  4.651315 1.907168 -2.35741
H  4.089491 0.371229 -1.722406
H  3.005411 1.375808 -2.70241
H  2.677682 4.098408 -0.065458
H  2.240862 3.692523 -1.734869
H  3.90899 4.090084 -1.323755
H  1.821524 -2.548933 -1.778411
H  2.905696 -2.458881 -0.39059
H  -0.144497 -2.789792 -0.225031
H  1.047561 -4.068243 -0.010201
H  0.960437 -2.761427 1.16292
elementType: S P O N C H
totalener: -1584.18467951 hartree
nucrepener: 2016.09071398 hartree
electener: -3600.27539349 hartree
oneelecener: -6180.93929772 hartree
twoeener: 2580.66390423 hartree
cpcmener: -0.02237036 hartree
kineticenergy: 1578.89829865 hartree
xcener: -118.037278336996 hartree
chargesum: 0.0000000
charge: -0.429296 0.706198 -0.329550 -0.340374 -0.334426 -0.391093 -0.355087 0.288122 -0.340215 -0.323260 -0.335045 0.251623 0.127600 0.195403 -0.010897 0.023455 -0.243221 -0.253178 0.040084 -0.243647 0.105126 0.097890 0.095920 0.096040 0.090269 0.099318 0.096704 0.103803 0.093256 0.079131 0.142018 0.135008 0.100873 0.085545 0.095519 0.099008 0.091815 0.093938 0.112693 0.098214 0.088524 0.111892 0.084303
qa: -0.4293 0.7062 -0.3296 -0.3404 -0.3344 -0.3911 -0.3551 0.2881 -0.3402 -0.3233 -0.3350 0.2516 0.1276 0.1954 -0.0109 0.0235 -0.2432 -0.2532 0.0401 -0.2436 0.1051 0.0979 0.0959 0.0960 0.0903 0.0993 0.0967 0.1038 0.0933 0.0791 0.1420 0.1350 0.1009 0.0855 0.0955 0.0990 0.0918 0.0939 0.1127 0.0982 0.0885 0.1119 0.0843
va: 2.0268 5.5124 2.1149 2.1121 2.0483 3.0428 3.0848 3.6295 3.9335 3.9256 3.9270 3.9542 3.8387 3.7682 4.0826 4.0546 3.8761 3.9321 3.8232 3.9043 1.0030 1.0030 1.0146 1.0100 1.0141 1.0029 1.0034 1.0030 1.0200 1.0201 1.0080 1.0273 1.0083 1.0199 1.0080 1.0084 1.0047 1.0053 0.9916 1.0120 1.0040 1.0102 1.0133
dispcorr: -0.021893121 hartree
energy: -1584.206572629513
dipole: -17.87833 18.25580 0.37747 -1.19543 0.99272 -0.20271 -15.73134 14.30224 -1.42910
magnitude: 1.49195 au
magnitude: 3.79222 debye
