program: Orca
programVersion: 5.0.2
elementType: S P O O O N N C C C C C C C C C C C C C H H H H H H H H H H H H H H H H H H H H H H H
charge: 0
multiplicity: 1
keywords: wb97x-d3
keywords: def2-TZVPP
keywords: def2/J RIJCOSX
keywords: DEFGRID2
keywords: scfconv7
keywords: smallprint printgap noloewdin
keywords: NOSOSCF
formula: C13H23N2O3PS
InChI: InChI=1/C13H23N2O3PS/c1-7-16-19(20,17-10(2)3)18-11-8-14-12(15-9-11)13(4,5)6/h8-10H,7H2,1-6H3
43 atoms
S  1.614989 0.259877 1.968313
P  1.776195 -0.015357 0.07681
O  3.057238 0.56351 -0.654752
O  0.602795 0.647985 -0.838118
O  1.708682 -1.514644 -0.444811
N  -2.667937 -0.864592 -1.003847
N  -2.719463 0.889526 0.556955
C  -4.755011 -0.419558 0.153773
C  -5.346031 0.498308 1.219961
C  -4.874476 -1.875509 0.618576
C  -5.534681 -0.240879 -1.154223
C  -3.292636 -0.10676 -0.104202
C  3.778817 1.747748 -0.213496
C  -0.714602 0.382648 -0.57542
C  -1.390263 -0.628498 -1.238235
C  -1.438727 1.137755 0.325928
C  5.145105 1.674668 -0.85649
C  3.01367 2.997866 -0.590061
C  2.289791 -2.616111 0.285215
C  3.798566 -2.584245 0.292821
H  -6.396189 0.244387 1.375337
H  -5.300121 1.548429 0.930737
H  -4.837543 0.394517 2.178976
H  -4.333591 -2.044466 1.551902
H  -5.922124 -2.126003 0.795249
H  -4.486842 -2.571332 -0.1254
H  -5.47332 0.785969 -1.52023
H  -6.589689 -0.471368 -0.994433
H  -5.165231 -0.900904 -1.939031
H  3.882259 1.690016 0.873666
H  -0.888932 -1.245856 -1.976959
H  -0.980371 1.96178 0.862051
H  5.750184 2.515427 -0.517147
H  5.667294 0.757612 -0.582087
H  5.079069 1.726316 -1.944457
H  2.840559 3.04933 -1.666102
H  3.5915 3.875991 -0.299714
H  2.052547 3.06034 -0.078276
H  1.89074 -2.621498 1.301333
H  1.923165 -3.504839 -0.225366
H  4.163291 -3.500038 0.759503
H  4.206352 -2.53926 -0.717038
H  4.193678 -1.746822 0.868754
elementType: S P O N C H
totalener: -1584.19726506 hartree
nucrepener: 1999.27990624 hartree
electener: -3583.47717131 hartree
oneelecener: -6147.80518872 hartree
twoeener: 2564.32801742 hartree
cpcmener: -0.01876310 hartree
kineticenergy: 1578.91629044 hartree
xcener: -118.038450842419 hartree
chargesum: 0.0000000
charge: -0.437183 0.742997 -0.336401 -0.355858 -0.346173 -0.391306 -0.344859 0.291123 -0.318297 -0.337195 -0.336733 0.250335 0.142026 0.221174 -0.000558 -0.002222 -0.246973 -0.239680 0.030938 -0.236276 0.097100 0.091674 0.092943 0.102983 0.095377 0.096156 0.103136 0.095506 0.096076 0.073901 0.140412 0.135042 0.091696 0.097619 0.090847 0.093353 0.099002 0.085175 0.095244 0.108168 0.099477 0.092179 0.078056
qa: -0.4372 0.7430 -0.3364 -0.3559 -0.3462 -0.3913 -0.3449 0.2911 -0.3183 -0.3372 -0.3367 0.2503 0.1420 0.2212 -0.0006 -0.0022 -0.2470 -0.2397 0.0309 -0.2363 0.0971 0.0917 0.0929 0.1030 0.0954 0.0962 0.1031 0.0955 0.0961 0.0739 0.1404 0.1350 0.0917 0.0976 0.0908 0.0934 0.0990 0.0852 0.0952 0.1082 0.0995 0.0922 0.0781
va: 1.9931 5.5204 2.1208 2.1017 2.1246 3.0523 3.0828 3.6352 3.9276 3.9326 3.9329 3.9519 3.8264 3.7214 4.1323 4.1095 3.9311 3.8968 3.8621 3.9000 1.0027 1.0131 1.0121 1.0029 1.0032 1.0180 1.0028 1.0030 1.0174 1.0226 1.0095 1.0127 1.0059 1.0068 1.0067 1.0092 1.0086 1.0175 1.0103 0.9915 1.0093 1.0059 1.0150
dispcorr: -0.020793829 hartree
energy: -1584.218058893478
dipole: -6.40666 8.05163 1.64497 -1.64147 1.45249 -0.18898 -1.50828 0.92704 -0.58124
magnitude: 1.75484 au
magnitude: 4.46046 debye
