program: Orca
programVersion: 5.0.2
elementType: S P O O O N N C C C C C C C C C C C C C H H H H H H H H H H H H H H H H H H H H H H H
charge: 0
multiplicity: 1
keywords: wb97x-d3
keywords: def2-TZVPP
keywords: def2/J RIJCOSX
keywords: DEFGRID2
keywords: scfconv7
keywords: smallprint printgap noloewdin
keywords: NOSOSCF
formula: C13H23N2O3PS
InChI: InChI=1/C13H23N2O3PS/c1-7-16-19(20,17-10(2)3)18-11-8-14-12(15-9-11)13(4,5)6/h8-10H,7H2,1-6H3
43 atoms
S  3.532558 -0.72904 1.551279
P  2.075581 -0.083146 0.49223
O  2.024109 1.46255 0.144597
O  0.665391 -0.244105 1.276875
O  1.838522 -0.763052 -0.927632
N  -2.229583 0.529165 -0.793983
N  -2.848966 -0.831114 1.009429
C  -4.58376 -0.113222 -0.531116
C  -5.053479 -1.554249 -0.761869
C  -4.769868 0.689902 -1.814808
C  -5.42407 0.519171 0.58514
C  -3.132076 -0.134917 -0.09118
C  3.184077 2.274485 -0.177567
C  -0.590877 -0.181746 0.747043
C  -0.966701 0.517171 -0.385697
C  -1.598067 -0.858842 1.420987
C  3.737148 1.909229 -1.538514
C  2.715131 3.709379 -0.10055
C  2.135863 -2.14508 -1.208223
C  1.161617 -3.096711 -0.558431
H  -4.472788 -2.045266 -1.545663
H  -6.099936 -1.562466 -1.073098
H  -4.971618 -2.155985 0.143538
H  -4.199933 0.274431 -2.64698
H  -5.823459 0.681405 -2.100633
H  -4.469859 1.731702 -1.696124
H  -5.3432 -0.038923 1.518363
H  -6.477508 0.535628 0.298342
H  -5.120353 1.549519 0.781788
H  3.940599 2.09197 0.590785
H  -0.265006 1.087578 -0.98247
H  -1.372309 -1.428062 2.317671
H  4.552916 2.587504 -1.78926
H  4.142368 0.896993 -1.563128
H  2.975329 1.999187 -2.31452
H  3.556206 4.378157 -0.281677
H  2.309309 3.944762 0.883882
H  1.950883 3.919638 -0.850759
H  2.087378 -2.2211 -2.293292
H  3.161636 -2.360257 -0.90205
H  1.384417 -4.109751 -0.895681
H  1.241828 -3.090736 0.529408
H  0.131745 -2.873004 -0.837591
elementType: S P O N C H
totalener: -1584.19512055 hartree
nucrepener: 2010.12520116 hartree
electener: -3594.32032171 hartree
oneelecener: -6168.94866651 hartree
twoeener: 2574.62834481 hartree
cpcmener: -0.01905380 hartree
kineticenergy: 1578.91085144 hartree
xcener: -118.040401840932 hartree
chargesum: -0.0000000
charge: -0.416620 0.679777 -0.319414 -0.319062 -0.324321 -0.348766 -0.387941 0.290508 -0.338254 -0.319810 -0.336922 0.239711 0.120663 0.198992 0.030235 -0.005656 -0.243139 -0.248813 0.033617 -0.240830 0.102648 0.095136 0.096038 0.093241 0.097650 0.092338 0.095800 0.095347 0.103076 0.079835 0.116652 0.136495 0.100023 0.086570 0.094935 0.090589 0.098434 0.091042 0.110440 0.097277 0.108464 0.085690 0.088327
qa: -0.4166 0.6798 -0.3194 -0.3191 -0.3243 -0.3488 -0.3879 0.2905 -0.3383 -0.3198 -0.3369 0.2397 0.1207 0.1990 0.0302 -0.0057 -0.2431 -0.2488 0.0336 -0.2408 0.1026 0.0951 0.0960 0.0932 0.0976 0.0923 0.0958 0.0953 0.1031 0.0798 0.1167 0.1365 0.1000 0.0866 0.0949 0.0906 0.0984 0.0910 0.1104 0.0973 0.1085 0.0857 0.0883
va: 2.0446 5.5326 2.1148 2.1327 2.0515 3.0925 3.0493 3.6319 3.9320 3.9267 3.9331 3.9639 3.8508 3.7608 4.0315 4.0910 3.8850 3.9325 3.8389 3.9000 1.0026 1.0034 1.0179 1.0121 1.0027 1.0128 1.0172 1.0031 1.0028 1.0194 1.0370 1.0095 1.0089 1.0196 1.0062 1.0060 1.0088 1.0048 0.9914 1.0115 1.0100 1.0156 1.0050
dispcorr: -0.021508598 hartree
energy: -1584.216629143943
dipole: -18.24294 18.70434 0.46140 3.70033 -3.52498 0.17535 -14.79943 13.44711 -1.35232
magnitude: 1.43959 au
magnitude: 3.65914 debye
