program: Orca
programVersion: 5.0.2
elementType: S P O O O N N C C C C C C C C C C C C C H H H H H H H H H H H H H H H H H H H H H H H
charge: 0
multiplicity: 1
keywords: wb97x-d3
keywords: def2-TZVPP
keywords: def2/J RIJCOSX
keywords: DEFGRID2
keywords: scfconv7
keywords: smallprint printgap noloewdin
keywords: NOSOSCF
formula: C13H23N2O3PS
InChI: InChI=1/C13H23N2O3PS/c1-7-16-19(20,17-10(2)3)18-11-8-14-12(15-9-11)13(4,5)6/h8-10H,7H2,1-6H3
43 atoms
S  3.473846 -0.236132 1.835966
P  2.042915 -0.469951 0.586939
O  1.938127 0.552631 -0.624341
O  0.605815 -0.403519 1.331402
O  1.917622 -1.875599 -0.142818
N  -2.242728 -0.418016 -0.937009
N  -2.86302 0.417493 1.162333
C  -4.571103 0.254741 -0.554469
C  -5.456865 -0.699285 0.25729
C  -4.727868 -0.052275 -2.040772
C  -5.007172 1.699689 -0.287965
C  -3.136746 0.075728 -0.09646
C  2.379162 1.935177 -0.57273
C  -0.629703 -0.251814 0.775305
C  -0.99604 -0.589848 -0.514251
C  -1.627972 0.262208 1.591676
C  2.416656 2.414349 -2.005627
C  1.454669 2.756616 0.299326
C  3.059742 -2.62911 -0.593803
C  3.742881 -2.004835 -1.785614
H  -5.172994 -1.742151 0.100704
H  -6.500842 -0.59331 -0.044822
H  -5.397742 -0.492371 1.326629
H  -4.112551 0.600674 -2.661859
H  -4.463807 -1.082735 -2.280331
H  -5.768102 0.097452 -2.336269
H  -6.03951 1.845292 -0.612113
H  -4.386991 2.413928 -0.83352
H  -4.953646 1.950767 0.771518
H  3.389509 1.946605 -0.154772
H  -0.299761 -1.012106 -1.229382
H  -1.408349 0.54364 2.617236
H  2.790788 3.437399 -2.038165
H  3.079887 1.799463 -2.615465
H  1.422466 2.405201 -2.45579
H  1.483254 2.438355 1.342614
H  0.42361 2.7052 -0.05441
H  1.766208 3.801244 0.274551
H  3.755906 -2.755054 0.238219
H  2.658817 -3.609524 -0.845026
H  4.503509 -2.69464 -2.152707
H  3.042356 -1.818752 -2.599951
H  4.245428 -1.070241 -1.534266
elementType: S P O N C H
totalener: -1584.19499115 hartree
nucrepener: 2014.69238977 hartree
electener: -3598.88738092 hartree
oneelecener: -6178.04445297 hartree
twoeener: 2579.15707205 hartree
cpcmener: -0.01906109 hartree
kineticenergy: 1578.91777847 hartree
xcener: -118.041886197622 hartree
chargesum: -0.0000000
charge: -0.417550 0.677000 -0.319154 -0.316477 -0.325655 -0.349287 -0.387999 0.289767 -0.339258 -0.318533 -0.337188 0.240256 0.136290 0.205649 0.025131 -0.006064 -0.249454 -0.250283 0.021138 -0.237717 0.103689 0.096245 0.096782 0.094376 0.090312 0.097624 0.095583 0.102476 0.095009 0.080547 0.118819 0.136088 0.092056 0.097555 0.091522 0.092928 0.092020 0.108622 0.095901 0.108611 0.100648 0.092411 0.079567
qa: -0.4176 0.6770 -0.3192 -0.3165 -0.3257 -0.3493 -0.3880 0.2898 -0.3393 -0.3185 -0.3372 0.2403 0.1363 0.2056 0.0251 -0.0061 -0.2495 -0.2503 0.0211 -0.2377 0.1037 0.0962 0.0968 0.0944 0.0903 0.0976 0.0956 0.1025 0.0950 0.0805 0.1188 0.1361 0.0921 0.0976 0.0915 0.0929 0.0920 0.1086 0.0959 0.1086 0.1006 0.0924 0.0796
va: 2.0412 5.5273 2.0541 2.1367 2.1016 3.0904 3.0509 3.6315 3.9342 3.9257 3.9301 3.9630 3.8155 3.7541 4.0368 4.0951 3.9431 3.8843 3.8652 3.8950 1.0030 1.0029 1.0154 1.0111 1.0141 1.0027 1.0033 1.0030 1.0193 1.0216 1.0358 1.0096 1.0063 1.0059 1.0054 1.0208 1.0063 1.0102 1.0098 0.9911 1.0102 1.0044 1.0144
dispcorr: -0.021690600 hartree
energy: -1584.216681754672
dipole: -16.91617 17.49176 0.57559 9.11324 -8.78355 0.32969 -17.56551 16.16427 -1.40124
magnitude: 1.55032 au
magnitude: 3.94059 debye
