program: Orca
programVersion: 5.0.2
elementType: S P O O O N N C C C C C C C C C C C C C H H H H H H H H H H H H H H H H H H H H H H H
charge: 0
multiplicity: 1
keywords: wb97x-d3
keywords: def2-TZVPP
keywords: def2/J RIJCOSX
keywords: DEFGRID2
keywords: scfconv7
keywords: smallprint printgap noloewdin
keywords: NOSOSCF
formula: C13H23N2O3PS
InChI: InChI=1/C13H23N2O3PS/c1-7-16-19(20,17-10(2)3)18-11-8-14-12(15-9-11)13(4,5)6/h8-10H,7H2,1-6H3
43 atoms
S  1.725038 -0.375616 1.962993
P  1.858554 -0.353759 0.050783
O  2.067453 1.03729 -0.676504
O  0.542299 -0.883549 -0.744168
O  2.966961 -1.257644 -0.631405
N  -3.026025 -1.075331 -0.730582
N  -2.42439 0.936722 0.308668
C  -4.80094 0.377288 0.070464
C  -5.008772 1.681914 0.833744
C  -5.453246 -0.771146 0.848467
C  -5.455588 0.488825 -1.312191
C  -3.327613 0.070068 -0.119582
C  2.832267 2.142816 -0.129149
C  -0.743201 -0.513495 -0.490151
C  -1.753625 -1.367537 -0.90891
C  -1.139967 0.659971 0.125251
C  4.31535 1.863101 -0.2456
C  2.401142 3.369947 -0.899402
C  3.36299 -2.548584 -0.120894
C  4.660447 -2.444286 0.639943
H  -4.564483 1.650737 1.829514
H  -6.077821 1.865731 0.956469
H  -4.586399 2.539283 0.308542
H  -5.367111 -1.719781 0.318595
H  -5.001983 -0.895532 1.835096
H  -6.51565 -0.567761 0.995891
H  -5.356787 -0.436518 -1.880493
H  -5.012658 1.294199 -1.901855
H  -6.520963 0.703961 -1.208091
H  2.557784 2.254776 0.923713
H  -1.513296 -2.302564 -1.405822
H  -0.433205 1.402579 0.477338
H  4.87625 2.733804 0.095293
H  4.625068 1.018296 0.37121
H  4.601247 1.662586 -1.279285
H  2.65792 3.287965 -1.956982
H  2.905929 4.248642 -0.49851
H  1.326709 3.537221 -0.815251
H  2.574716 -2.974242 0.50342
H  3.470646 -3.187413 -0.996863
H  4.975686 -3.442053 0.947539
H  5.452755 -2.020432 0.022075
H  4.551082 -1.835993 1.537687
elementType: S P O N C H
totalener: -1584.19572473 hartree
nucrepener: 1987.93968991 hartree
electener: -3572.13541465 hartree
oneelecener: -6124.93652758 hartree
twoeener: 2552.80111293 hartree
cpcmener: -0.01927315 hartree
kineticenergy: 1578.91799889 hartree
xcener: -118.041357745509 hartree
chargesum: 0.0000000
charge: -0.432166 0.726827 -0.336482 -0.321327 -0.340737 -0.390168 -0.348758 0.290834 -0.319721 -0.336566 -0.339099 0.240590 0.139155 0.239857 -0.014235 0.014102 -0.242526 -0.246604 0.045827 -0.246645 0.093912 0.097364 0.090926 0.094553 0.103022 0.095105 0.096196 0.103658 0.096005 0.076194 0.136563 0.105969 0.098987 0.085409 0.094609 0.090807 0.091195 0.097625 0.091153 0.106496 0.100746 0.091454 0.079894
qa: -0.4322 0.7268 -0.3365 -0.3213 -0.3407 -0.3902 -0.3488 0.2908 -0.3197 -0.3366 -0.3391 0.2406 0.1392 0.2399 -0.0142 0.0141 -0.2425 -0.2466 0.0458 -0.2466 0.0939 0.0974 0.0909 0.0946 0.1030 0.0951 0.0962 0.1037 0.0960 0.0762 0.1366 0.1060 0.0990 0.0854 0.0946 0.0908 0.0912 0.0976 0.0912 0.1065 0.1007 0.0915 0.0799
va: 1.9860 5.5288 2.1122 2.1576 2.1143 3.0519 3.0952 3.6312 3.9268 3.9323 3.9339 3.9618 3.8257 3.7218 4.1052 4.0585 3.9133 3.9287 3.8488 3.9173 1.0115 1.0028 1.0132 1.0187 1.0027 1.0032 1.0165 1.0028 1.0030 1.0195 1.0080 1.0305 1.0092 1.0133 1.0082 1.0062 1.0063 1.0064 1.0085 0.9962 1.0100 1.0023 1.0158
dispcorr: -0.020581803 hartree
energy: -1584.216306537038
dipole: -7.50087 9.15067 1.64980 8.42445 -8.41045 0.01401 -1.19265 0.56834 -0.62431
magnitude: 1.76403 au
magnitude: 4.48382 debye
