program: Orca
programVersion: 5.0.2
elementType: S P O O O N N C C C C C C C C C C C C C H H H H H H H H H H H H H H H H H H H H H H H
charge: 0
multiplicity: 1
keywords: wb97x-d3
keywords: def2-TZVPP
keywords: def2/J RIJCOSX
keywords: DEFGRID2
keywords: scfconv7
keywords: smallprint printgap noloewdin
keywords: NOSOSCF
formula: C13H23N2O3PS
InChI: InChI=1/C13H23N2O3PS/c1-7-16-19(20,17-10(2)3)18-11-8-14-12(15-9-11)13(4,5)6/h8-10H,7H2,1-6H3
43 atoms
S  1.796737 0.339029 1.782467
P  1.943391 -0.258064 -0.036146
O  1.927518 0.800557 -1.210777
O  0.727855 -1.219555 -0.542809
O  3.185984 -1.178632 -0.398298
N  -2.587071 -0.913338 0.84292
N  -2.480417 0.334762 -1.142875
C  -4.555262 0.345797 0.147811
C  -5.372233 -0.732556 0.861337
C  -5.236706 0.6989 -1.173909
C  -4.486437 1.598824 1.033113
C  -3.128223 -0.118531 -0.075549
C  2.583488 2.096993 -1.266439
C  -0.574136 -0.827407 -0.382944
C  -1.321369 -1.264851 0.695962
C  -1.213348 -0.014309 -1.30103
C  1.727057 3.142058 -0.585002
C  4.005629 2.047621 -0.749639
C  3.825409 -2.044974 0.560444
C  2.993167 -3.258301 0.895149
H  -6.397338 -0.384706 1.002251
H  -4.967416 -0.974344 1.842988
H  -5.415916 -1.656284 0.280812
H  -4.743146 1.522824 -1.687699
H  -5.263273 -0.152608 -1.856592
H  -6.26888 0.999673 -0.985161
H  -5.490945 1.981516 1.225593
H  -3.913422 2.396146 0.555581
H  -4.022765 1.382874 1.997586
H  2.607915 2.303366 -2.337105
H  -0.890281 -1.920922 1.445394
H  -0.699775 0.353608 -2.183094
H  1.703834 3.009515 0.49635
H  2.134533 4.131525 -0.795484
H  0.703252 3.120081 -0.960466
H  4.049679 1.861794 0.32462
H  4.478895 3.012602 -0.933981
H  4.597689 1.290465 -1.2642
H  4.762131 -2.334169 0.087117
H  4.065391 -1.473415 1.459259
H  2.717762 -3.818104 0.001193
H  3.578224 -3.918902 1.536126
H  2.084976 -2.99751 1.439756
elementType: S P O N C H
totalener: -1584.19232552 hartree
nucrepener: 2022.23424719 hartree
electener: -3606.42657272 hartree
oneelecener: -6193.84148545 hartree
twoeener: 2587.41491273 hartree
cpcmener: -0.01863833 hartree
kineticenergy: 1578.91993730 hartree
xcener: -118.042516010298 hartree
chargesum: 0.0000000
charge: -0.438079 0.753039 -0.349493 -0.354711 -0.343612 -0.371559 -0.369249 0.266436 -0.318402 -0.314851 -0.340296 0.254990 0.162092 0.218507 -0.008881 0.002718 -0.276132 -0.275182 0.036257 -0.234571 0.095993 0.090944 0.100528 0.088198 0.100362 0.096521 0.098991 0.102735 0.101990 0.085769 0.138546 0.140603 0.090058 0.103470 0.099368 0.088135 0.102989 0.105980 0.109977 0.093235 0.091598 0.098411 0.076576
qa: -0.4381 0.7530 -0.3495 -0.3547 -0.3436 -0.3716 -0.3692 0.2664 -0.3184 -0.3149 -0.3403 0.2550 0.1621 0.2185 -0.0089 0.0027 -0.2761 -0.2752 0.0363 -0.2346 0.0960 0.0909 0.1005 0.0882 0.1004 0.0965 0.0990 0.1027 0.1020 0.0858 0.1385 0.1406 0.0901 0.1035 0.0994 0.0881 0.1030 0.1060 0.1100 0.0932 0.0916 0.0984 0.0766
va: 1.9773 5.5104 2.1312 2.0982 2.1103 3.0690 3.0655 3.6579 3.9151 3.9167 3.9330 3.9509 3.8501 3.7332 4.1272 4.1134 3.9336 3.8940 3.8492 3.9073 1.0035 1.0221 1.0066 1.0205 1.0076 1.0034 1.0023 1.0069 1.0082 0.9918 1.0068 1.0121 1.0149 1.0079 1.0054 1.0219 1.0075 1.0101 0.9916 1.0117 1.0065 1.0094 1.0145
dispcorr: -0.021618896 hartree
energy: -1584.213944419709
dipole: -11.69319 13.25156 1.55837 7.64217 -7.54065 0.10151 0.46589 -1.14405 -0.67816
magnitude: 1.70256 au
magnitude: 4.32757 debye
