program: Orca
programVersion: 5.0.2
elementType: S P O O O N N C C C C C C C C C C C C C H H H H H H H H H H H H H H H H H H H H H H H
charge: 0
multiplicity: 1
keywords: wb97x-d3
keywords: def2-TZVPP
keywords: def2/J RIJCOSX
keywords: DEFGRID2
keywords: scfconv7
keywords: smallprint printgap noloewdin
keywords: NOSOSCF
formula: C13H23N2O3PS
InChI: InChI=1/C13H23N2O3PS/c1-7-16-19(20,17-10(2)3)18-11-8-14-12(15-9-11)13(4,5)6/h8-10H,7H2,1-6H3
43 atoms
S  1.595831 1.281243 1.97438
P  1.908538 0.236613 0.401508
O  3.202108 0.532702 -0.465701
O  0.770116 0.373708 -0.766008
O  1.995375 -1.313683 0.715676
N  -2.660843 0.840148 0.260359
N  -2.424882 -1.294133 -0.690238
C  -4.621328 -0.585159 0.143588
C  -4.851052 -0.559483 1.660142
C  -5.07704 -1.931127 -0.412127
C  -5.438438 0.533444 -0.512626
C  -3.146927 -0.340609 -0.118408
C  3.797115 1.853087 -0.611382
C  -0.550976 0.128578 -0.511449
C  -1.377762 1.080733 0.064171
C  -1.1335 -1.066199 -0.882687
C  5.21208 1.628345 -1.090982
C  2.979027 2.698817 -1.562611
C  2.324891 -2.330226 -0.260624
C  1.648347 -3.610989 0.151919
H  -5.906749 -0.725993 1.883614
H  -4.566027 0.399257 2.094658
H  -4.279747 -1.340806 2.165822
H  -4.939997 -1.997478 -1.492324
H  -4.544763 -2.767429 0.04209
H  -6.140634 -2.067034 -0.206863
H  -5.29094 0.556275 -1.594441
H  -5.175684 1.514313 -0.116897
H  -6.503008 0.375496 -0.329285
H  3.815766 2.320245 0.377089
H  -0.995443 2.052978 0.355694
H  -0.550736 -1.84737 -1.360929
H  5.232138 1.153371 -2.07327
H  5.722519 2.588011 -1.171851
H  5.777328 1.010386 -0.392709
H  1.986683 2.920047 -1.168155
H  2.869294 2.212654 -2.533077
H  3.48186 3.653427 -1.720433
H  2.002988 -2.0266 -1.258595
H  3.409675 -2.444547 -0.274918
H  1.962744 -3.928432 1.146641
H  0.562331 -3.512671 0.145661
H  1.91836 -4.400738 -0.549701
elementType: S P O N C H
totalener: -1584.19651012 hartree
nucrepener: 1999.86450788 hartree
electener: -3584.06101800 hartree
oneelecener: -6148.58280312 hartree
twoeener: 2564.52178513 hartree
cpcmener: -0.02237450 hartree
kineticenergy: 1578.90297694 hartree
xcener: -118.034562440563 hartree
chargesum: 0.0000000
charge: -0.424002 0.714081 -0.325298 -0.351740 -0.340255 -0.388064 -0.352655 0.289827 -0.337815 -0.318988 -0.336797 0.249069 0.127714 0.247929 -0.001242 -0.004724 -0.243932 -0.237440 -0.000877 -0.237803 0.095786 0.097413 0.103765 0.093512 0.090624 0.097945 0.102492 0.095800 0.095217 0.073416 0.130659 0.143981 0.090160 0.089724 0.097533 0.084910 0.093126 0.098825 0.112179 0.116304 0.093135 0.084916 0.091587
qa: -0.4240 0.7141 -0.3253 -0.3517 -0.3403 -0.3881 -0.3527 0.2898 -0.3378 -0.3190 -0.3368 0.2491 0.1277 0.2479 -0.0012 -0.0047 -0.2439 -0.2374 -0.0009 -0.2378 0.0958 0.0974 0.1038 0.0935 0.0906 0.0979 0.1025 0.0958 0.0952 0.0734 0.1307 0.1440 0.0902 0.0897 0.0975 0.0849 0.0931 0.0988 0.1122 0.1163 0.0931 0.0849 0.0916
va: 2.0223 5.5310 2.1137 2.0518 2.1160 3.0612 3.0795 3.6347 3.9335 3.9284 3.9311 3.9556 3.8498 3.6856 4.1312 4.1115 3.9241 3.8814 3.8512 3.9476 1.0031 1.0159 1.0029 1.0114 1.0132 1.0027 1.0027 1.0190 1.0033 1.0219 1.0172 0.9983 1.0066 1.0064 1.0087 1.0184 1.0092 1.0087 0.9906 0.9979 1.0041 1.0053 1.0061
dispcorr: -0.021063464 hartree
energy: -1584.217573582675
dipole: -11.30309 12.70982 1.40673 -6.11410 5.56553 -0.54857 -8.35188 6.55110 -1.80077
magnitude: 2.35002 au
magnitude: 5.97327 debye
