program: Orca
programVersion: 5.0.2
elementType: S P O O O N N C C C C C C C C C C C C C H H H H H H H H H H H H H H H H H H H H H H H
charge: 0
multiplicity: 1
keywords: wb97x-d3
keywords: def2-TZVPP
keywords: def2/J RIJCOSX
keywords: DEFGRID2
keywords: scfconv7
keywords: smallprint printgap noloewdin
keywords: NOSOSCF
formula: C13H23N2O3PS
InChI: InChI=1/C13H23N2O3PS/c1-7-16-19(20,17-10(2)3)18-11-8-14-12(15-9-11)13(4,5)6/h8-10H,7H2,1-6H3
43 atoms
S  1.402529 -1.148505 1.98466
P  1.894126 -0.362829 0.308605
O  2.225145 1.176865 0.425354
O  0.76014 -0.499024 -0.864452
O  3.139637 -0.954113 -0.477184
N  -2.459782 1.119562 -0.763597
N  -2.659585 -1.027958 0.164208
C  -4.635138 0.380693 0.094546
C  -5.453921 -0.752002 -0.53427
C  -5.115617 1.717244 -0.463251
C  -4.83181 0.365614 1.616085
C  -3.163181 0.152562 -0.192425
C  2.628748 2.046792 -0.675489
C  -0.565322 -0.277733 -0.613804
C  -1.167662 0.90982 -0.972619
C  -1.375205 -1.248177 -0.04446
C  1.897719 3.356139 -0.482589
C  4.132033 2.214156 -0.64368
C  3.276206 -2.367395 -0.748851
C  4.242367 -3.00706 0.214634
H  -5.175983 -1.725989 -0.132173
H  -5.325238 -0.786199 -1.618146
H  -6.516351 -0.600932 -0.33379
H  -4.998006 1.775824 -1.546266
H  -6.17666 1.844172 -0.240434
H  -4.583569 2.562389 -0.025868
H  -5.884144 0.522096 1.861477
H  -4.258204 1.157221 2.102786
H  -4.526334 -0.586382 2.051639
H  2.324074 1.594818 -1.623089
H  -0.601573 1.7030 -1.449737
H  -0.976158 -2.216959 0.235582
H  0.815971 3.22293 -0.482284
H  2.185136 3.834642 0.455287
H  2.148184 4.037282 -1.296013
H  4.45971 2.640192 0.305938
H  4.437537 2.89582 -1.43815
H  4.65444 1.271303 -0.800228
H  2.303466 -2.862862 -0.71307
H  3.639285 -2.433007 -1.773756
H  4.393568 -4.04806 -0.073435
H  5.213309 -2.511427 0.19633
H  3.86096 -2.992789 1.235206
elementType: S P O N C H
totalener: -1584.19527207 hartree
nucrepener: 2001.93562497 hartree
electener: -3586.13089703 hartree
oneelecener: -6152.74985763 hartree
twoeener: 2566.61896060 hartree
cpcmener: -0.02271373 hartree
kineticenergy: 1578.91069348 hartree
xcener: -118.036551473293 hartree
chargesum: 0.0000000
charge: -0.427035 0.718330 -0.341338 -0.356904 -0.326000 -0.352944 -0.387972 0.287806 -0.335680 -0.317750 -0.337757 0.251202 0.133048 0.248364 -0.011487 -0.002599 -0.249710 -0.261399 0.031553 -0.233073 0.095259 0.102201 0.095209 0.093640 0.097874 0.090237 0.095944 0.103917 0.097342 0.086006 0.149753 0.132876 0.096019 0.095395 0.095496 0.090624 0.097189 0.095012 0.094408 0.107529 0.093743 0.089142 0.076531
qa: -0.4270 0.7183 -0.3413 -0.3569 -0.3260 -0.3529 -0.3880 0.2878 -0.3357 -0.3177 -0.3378 0.2512 0.1330 0.2484 -0.0115 -0.0026 -0.2497 -0.2614 0.0316 -0.2331 0.0953 0.1022 0.0952 0.0936 0.0979 0.0902 0.0959 0.1039 0.0973 0.0860 0.1498 0.1329 0.0960 0.0954 0.0955 0.0906 0.0972 0.0950 0.0944 0.1075 0.0937 0.0891 0.0765
va: 2.0141 5.5293 2.1324 2.0537 2.0975 3.0821 3.0582 3.6380 3.9302 3.9267 3.9337 3.9522 3.8311 3.6845 4.1162 4.1278 3.9287 3.9307 3.8643 3.9284 1.0194 1.0029 1.0034 1.0113 1.0027 1.0138 1.0031 1.0030 1.0156 1.0071 0.9962 1.0168 1.0079 1.0077 1.0051 1.0068 1.0058 1.0172 0.9998 0.9950 1.0086 1.0038 1.0193
dispcorr: -0.021172795 hartree
energy: -1584.216444860371
dipole: -9.69922 11.06286 1.36364 8.19696 -7.91010 0.28686 -5.37077 3.36938 -2.00139
magnitude: 2.43873 au
magnitude: 6.19875 debye
