program: Orca
programVersion: 5.0.2
elementType: S P O O O N N C C C C C C C C C C C C C H H H H H H H H H H H H H H H H H H H H H H H
charge: 0
multiplicity: 1
keywords: wb97x-d3
keywords: def2-TZVPP
keywords: def2/J RIJCOSX
keywords: DEFGRID2
keywords: scfconv7
keywords: smallprint printgap noloewdin
keywords: NOSOSCF
formula: C13H23N2O3PS
InChI: InChI=1/C13H23N2O3PS/c1-7-16-19(20,17-10(2)3)18-11-8-14-12(15-9-11)13(4,5)6/h8-10H,7H2,1-6H3
43 atoms
S  1.54933 -0.487397 1.977612
P  2.125899 -0.348925 0.153467
O  2.823839 0.998777 -0.30315
O  0.928053 -0.575468 -0.938342
O  3.225432 -1.349776 -0.393322
N  -2.328827 0.966674 -0.883242
N  -2.442078 -1.092284 0.240714
C  -4.46124 0.246425 0.09441
C  -5.000561 1.502894 -0.582266
C  -4.616035 0.383039 1.614344
C  -5.258039 -0.968594 -0.39196
C  -2.990086 0.034745 -0.211857
C  2.243123 2.302893 -0.015894
C  -0.393271 -0.364444 -0.667833
C  -1.036991 0.772994 -1.109807
C  -1.15778 -1.295858 0.01669
C  3.058319 2.95646 1.075951
C  2.238941 3.082739 -1.310334
C  3.335592 -2.720558 0.041861
C  2.326535 -3.619349 -0.62669
H  -6.060704 1.616025 -0.347057
H  -4.908955 1.455522 -1.66845
H  -4.490593 2.405893 -0.245553
H  -4.060861 1.241761 1.998095
H  -5.666894 0.52641 1.874807
H  -4.262264 -0.506044 2.137853
H  -5.162964 -1.104569 -1.471442
H  -6.318442 -0.83355 -0.169665
H  -4.932998 -1.889293 0.092334
H  1.213169 2.17499 0.333184
H  -0.502028 1.53882 -1.663748
H  -0.722564 -2.221631 0.378523
H  2.649543 3.942282 1.300588
H  3.033862 2.369469 1.994529
H  4.098652 3.084677 0.771834
H  1.784283 4.060698 -1.148457
H  1.664282 2.57276 -2.084359
H  3.252877 3.242066 -1.682487
H  4.350985 -3.010697 -0.223468
H  3.248691 -2.765814 1.129583
H  1.307362 -3.418867 -0.294213
H  2.365687 -3.52824 -1.712755
H  2.5551 -4.655233 -0.371509
elementType: S P O N C H
totalener: -1584.19423950 hartree
nucrepener: 2018.83795172 hartree
electener: -3603.03219122 hartree
oneelecener: -6186.42929033 hartree
twoeener: 2583.39709911 hartree
cpcmener: -0.02193619 hartree
kineticenergy: 1578.91040213 hartree
xcener: -118.038748354796 hartree
chargesum: -0.0000000
charge: -0.439743 0.740896 -0.343732 -0.358542 -0.336094 -0.351831 -0.389447 0.286939 -0.318589 -0.338357 -0.335712 0.249695 0.134211 0.245241 -0.001063 0.005277 -0.242779 -0.248871 0.039074 -0.243049 0.097803 0.093844 0.090509 0.103736 0.096117 0.097511 0.102281 0.095046 0.095583 0.065483 0.143029 0.129274 0.096052 0.086763 0.093189 0.096608 0.093786 0.097088 0.108236 0.091526 0.081832 0.092061 0.099115
qa: -0.4397 0.7409 -0.3437 -0.3585 -0.3361 -0.3518 -0.3894 0.2869 -0.3186 -0.3384 -0.3357 0.2497 0.1342 0.2452 -0.0011 0.0053 -0.2428 -0.2489 0.0391 -0.2430 0.0978 0.0938 0.0905 0.1037 0.0961 0.0975 0.1023 0.0950 0.0956 0.0655 0.1430 0.1293 0.0961 0.0868 0.0932 0.0966 0.0938 0.0971 0.1082 0.0915 0.0818 0.0921 0.0991
va: 1.9821 5.5295 2.1162 2.0650 2.1311 3.0834 3.0673 3.6367 3.9273 3.9340 3.9298 3.9522 3.8566 3.6824 4.0936 4.1142 3.9391 3.9316 3.8546 3.9112 1.0025 1.0113 1.0139 1.0031 1.0028 1.0155 1.0028 1.0034 1.0197 1.0071 1.0040 1.0093 1.0061 1.0197 1.0077 1.0053 1.0102 1.0076 0.9911 1.0113 1.0016 1.0061 1.0096
dispcorr: -0.021682721 hartree
energy: -1584.215922218636
dipole: -16.72799 17.35267 0.62468 6.79735 -6.72287 0.07448 -1.68411 0.97196 -0.71214
magnitude: 0.95022 au
magnitude: 2.41527 debye
