program: Orca
programVersion: 5.0.2
elementType: S P O O O N N C C C C C C C C C C C C C H H H H H H H H H H H H H H H H H H H H H H H
charge: 0
multiplicity: 1
keywords: wb97x-d3
keywords: def2-TZVPP
keywords: def2/J RIJCOSX
keywords: DEFGRID2
keywords: scfconv7
keywords: smallprint printgap noloewdin
keywords: NOSOSCF
formula: C13H23N2O3PS
InChI: InChI=1/C13H23N2O3PS/c1-7-16-19(20,17-10(2)3)18-11-8-14-12(15-9-11)13(4,5)6/h8-10H,7H2,1-6H3
43 atoms
S  1.475323 0.489744 2.20307
P  1.796988 -0.046553 0.394068
O  3.115831 0.445525 -0.332671
O  0.683308 0.47698 -0.687488
O  1.827955 -1.621373 0.221028
N  -2.698799 0.913491 0.501539
N  -2.60899 -0.977522 -0.887398
C  -4.747815 -0.370207 0.090978
C  -5.446812 -0.149751 -1.256512
C  -5.34434 0.577805 1.127873
C  -4.970395 -1.816472 0.54551
C  -3.261987 -0.12643 -0.09854
C  3.755387 1.731817 -0.103231
C  -0.649971 0.265457 -0.468072
C  -1.402165 1.11488 0.320036
C  -1.314388 -0.790194 -1.068298
C  5.170761 1.591512 -0.61498
C  2.987147 2.837726 -0.793776
C  2.177064 -2.299816 -1.010622
C  3.603614 -2.786241 -0.970137
H  -5.316865 0.874415 -1.612427
H  -6.518896 -0.331055 -1.157055
H  -5.066059 -0.823591 -2.024892
H  -5.247519 1.623955 0.836937
H  -6.408928 0.365609 1.244088
H  -4.877694 0.460599 2.106982
H  -6.037198 -2.003148 0.683012
H  -4.47568 -2.019644 1.497648
H  -4.599765 -2.534852 -0.185219
H  3.770479 1.908508 0.975796
H  -0.954279 1.97681 0.802393
H  -0.78882 -1.48611 -1.715167
H  5.190927 1.396587 -1.688567
H  5.71531 2.518141 -0.433437
H  5.703175 0.788525 -0.104285
H  2.883472 2.643131 -1.862291
H  3.526007 3.77823 -0.674754
H  1.994098 2.981017 -0.366766
H  1.484404 -3.137551 -1.080979
H  2.002635 -1.655371 -1.874182
H  4.319302 -1.964952 -0.957616
H  3.78363 -3.419711 -0.101201
H  3.798211 -3.383309 -1.862048
elementType: S P O N C H
totalener: -1584.19614123 hartree
nucrepener: 1998.63369667 hartree
electener: -3582.82983790 hartree
oneelecener: -6146.21997970 hartree
twoeener: 2563.39014180 hartree
cpcmener: -0.02221589 hartree
kineticenergy: 1578.90517735 hartree
xcener: -118.035277806327 hartree
chargesum: -0.0000000
charge: -0.422531 0.715534 -0.320009 -0.354670 -0.346601 -0.346785 -0.392279 0.286541 -0.338222 -0.317569 -0.334143 0.251281 0.125541 0.238601 0.001078 0.000894 -0.254636 -0.238025 0.034374 -0.251887 0.104113 0.096555 0.096428 0.089882 0.097055 0.095406 0.095180 0.103031 0.094545 0.073503 0.130723 0.139314 0.092294 0.095917 0.098512 0.093257 0.098465 0.086387 0.111254 0.104027 0.082652 0.089606 0.095405
qa: -0.4225 0.7155 -0.3200 -0.3547 -0.3466 -0.3468 -0.3923 0.2865 -0.3382 -0.3176 -0.3341 0.2513 0.1255 0.2386 0.0011 0.0009 -0.2546 -0.2380 0.0344 -0.2519 0.1041 0.0966 0.0964 0.0899 0.0971 0.0954 0.0952 0.1030 0.0945 0.0735 0.1307 0.1393 0.0923 0.0959 0.0985 0.0933 0.0985 0.0864 0.1113 0.1040 0.0827 0.0896 0.0954
va: 2.0266 5.5276 2.1140 2.0497 2.1119 3.0847 3.0606 3.6405 3.9340 3.9260 3.9301 3.9473 3.8565 3.6999 4.1170 4.1367 3.9171 3.8835 3.8385 3.9581 1.0030 1.0027 1.0155 1.0146 1.0028 1.0108 1.0033 1.0030 1.0197 1.0211 1.0169 1.0025 1.0060 1.0074 1.0072 1.0086 1.0090 1.0173 0.9898 0.9965 1.0091 1.0036 1.0067
dispcorr: -0.021191282 hartree
energy: -1584.217332512226
dipole: -7.27360 8.84455 1.57095 -1.21317 1.18401 -0.02916 -9.61249 7.64440 -1.96809
magnitude: 2.51836 au
magnitude: 6.40116 debye
