program: Orca
programVersion: 5.0.2
elementType: S P O O O N N C C C C C C C C C C C C C H H H H H H H H H H H H H H H H H H H H H H H
charge: 0
multiplicity: 1
keywords: wb97x-d3
keywords: def2-TZVPP
keywords: def2/J RIJCOSX
keywords: DEFGRID2
keywords: scfconv7
keywords: smallprint printgap noloewdin
keywords: NOSOSCF
formula: C13H23N2O3PS
InChI: InChI=1/C13H23N2O3PS/c1-7-16-19(20,17-10(2)3)18-11-8-14-12(15-9-11)13(4,5)6/h8-10H,7H2,1-6H3
43 atoms
S  1.628023 0.056178 2.362956
P  1.824515 -0.493871 0.540123
O  1.878296 0.654319 -0.55962
O  0.621401 -1.406018 -0.077363
O  3.066523 -1.449274 0.312564
N  -2.767491 -0.63532 0.891344
N  -2.376917 0.230118 -1.257037
C  -4.568838 0.56794 -0.203927
C  -4.887207 1.308278 -1.499468
C  -4.730505 1.531791 0.977431
C  -5.54452 -0.602796 -0.038761
C  -3.150379 0.026121 -0.199978
C  2.412142 1.984099 -0.313241
C  -0.65565 -0.910843 -0.118809
C  -1.533021 -1.099974 0.937185
C  -1.134859 -0.232749 -1.221615
C  3.923733 1.942296 -0.27821
C  1.866022 2.867225 -1.410664
C  3.416405 -2.02026 -0.972841
C  4.916468 -2.11489 -1.059644
H  -5.913219 1.679526 -1.461303
H  -4.80376 0.662535 -2.374032
H  -4.232817 2.166417 -1.65444
H  -4.53443 1.041941 1.931243
H  -4.056443 2.386644 0.892108
H  -5.751136 1.918684 1.005486
H  -6.571719 -0.233119 -0.017968
H  -5.369618 -1.148772 0.888308
H  -5.466134 -1.310557 -0.866587
H  2.030079 2.321879 0.653989
H  -1.229164 -1.647318 1.823316
H  -0.512385 -0.068751 -2.094938
H  4.297032 1.314675 0.532346
H  4.335047 1.579622 -1.221816
H  4.309789 2.948358 -0.108706
H  2.187408 3.89528 -1.243019
H  0.775492 2.858298 -1.422228
H  2.228248 2.557824 -2.392361
H  2.954837 -3.006533 -1.035137
H  3.023162 -1.408012 -1.786297
H  5.38258 -1.129661 -1.027658
H  5.329485 -2.72348 -0.25501
H  5.189224 -2.584015 -2.005523
elementType: S P O N C H
totalener: -1584.19736399 hartree
nucrepener: 2006.06325984 hartree
electener: -3590.26062383 hartree
oneelecener: -6161.01654221 hartree
twoeener: 2570.75591838 hartree
cpcmener: -0.02092770 hartree
kineticenergy: 1578.90112842 hartree
xcener: -118.033677233589 hartree
chargesum: -0.0000000
charge: -0.424410 0.708784 -0.333258 -0.349713 -0.334903 -0.387934 -0.348429 0.292446 -0.321531 -0.336165 -0.337146 0.250412 0.147701 0.227617 -0.010746 -0.001324 -0.257429 -0.256288 0.023335 -0.238114 0.097690 0.092084 0.093260 0.096209 0.103013 0.095346 0.095242 0.096351 0.103074 0.075816 0.139363 0.139624 0.091784 0.091451 0.107527 0.095835 0.098907 0.090546 0.110059 0.106506 0.084850 0.091430 0.091129
qa: -0.4244 0.7088 -0.3333 -0.3497 -0.3349 -0.3879 -0.3484 0.2924 -0.3215 -0.3362 -0.3371 0.2504 0.1477 0.2276 -0.0107 -0.0013 -0.2574 -0.2563 0.0233 -0.2381 0.0977 0.0921 0.0933 0.0962 0.1030 0.0953 0.0952 0.0964 0.1031 0.0758 0.1394 0.1396 0.0918 0.0915 0.1075 0.0958 0.0989 0.0905 0.1101 0.1065 0.0849 0.0914 0.0911
va: 2.0268 5.5332 2.0718 2.0912 2.1142 3.0542 3.0691 3.6310 3.9296 3.9329 3.9331 3.9541 3.8227 3.7124 4.1292 4.0919 3.8926 3.9330 3.8477 3.9486 1.0027 1.0126 1.0119 1.0180 1.0027 1.0030 1.0030 1.0179 1.0026 1.0242 1.0131 1.0101 1.0188 1.0050 1.0104 1.0066 1.0062 1.0065 0.9953 0.9971 1.0049 1.0034 1.0071
dispcorr: -0.021292416 hartree
energy: -1584.218656406345
dipole: -7.82817 9.20199 1.37383 11.93992 -11.68443 0.25550 -13.23562 11.22141 -2.01421
magnitude: 2.45148 au
magnitude: 6.23115 debye
