program: Orca
programVersion: 5.0.2
elementType: S P O O O N N C C C C C C C C C C C C C H H H H H H H H H H H H H H H H H H H H H H H
charge: 0
multiplicity: 1
keywords: wb97x-d3
keywords: def2-TZVPP
keywords: def2/J RIJCOSX
keywords: DEFGRID2
keywords: scfconv7
keywords: smallprint printgap noloewdin
keywords: NOSOSCF
formula: C13H23N2O3PS
InChI: InChI=1/C13H23N2O3PS/c1-7-16-19(20,17-10(2)3)18-11-8-14-12(15-9-11)13(4,5)6/h8-10H,7H2,1-6H3
43 atoms
S  3.498543 -0.37856 1.689113
P  1.935906 -0.19769 0.600146
O  1.639422 1.186943 -0.11175
O  0.595665 -0.374883 1.503587
O  1.753799 -1.217621 -0.611748
N  -2.531932 1.096944 0.47262
N  -2.580907 -1.202157 -0.004261
C  -4.528002 0.18574 -0.560742
C  -5.444604 0.683685 0.562712
C  -5.082225 -1.118532 -1.124726
C  -4.479149 1.235769 -1.676965
C  -3.129526 0.004363 -0.000559
C  2.663905 2.055568 -0.670523
C  -0.657847 -0.242753 0.964856
C  -1.307081 0.980985 0.948659
C  -1.35153 -1.330171 0.475781
C  3.274114 1.437725 -1.909505
C  1.980335 3.374336 -0.947777
C  2.12384 -2.610349 -0.498176
C  3.459355 -2.861016 -1.149649
H  -5.097174 1.6304 0.977466
H  -5.507862 -0.038441 1.379475
H  -6.455259 0.838649 0.179749
H  -4.469152 -1.507195 -1.938694
H  -5.15862 -1.89722 -0.365342
H  -6.084301 -0.945892 -1.521832
H  -4.129267 2.200794 -1.310811
H  -5.476037 1.381214 -2.097699
H  -3.820973 0.925325 -2.491233
H  3.434535 2.19333 0.093002
H  -0.829089 1.873602 1.33913
H  -0.914821 -2.32395 0.482739
H  3.97136 2.146394 -2.357907
H  3.838807 0.531709 -1.685586
H  2.512398 1.200443 -2.653504
H  1.197246 3.268788 -1.700404
H  2.711704 4.09015 -1.323166
H  1.53995 3.794294 -0.043142
H  2.134042 -2.92158 0.548596
H  1.332032 -3.165807 -0.999132
H  4.262296 -2.333892 -0.635434
H  3.680979 -3.928382 -1.110246
H  3.455111 -2.560124 -2.197488
elementType: S P O N C H
totalener: -1584.19600599 hartree
nucrepener: 2011.58209701 hartree
electener: -3595.77810301 hartree
oneelecener: -6171.96830266 hartree
twoeener: 2576.19019965 hartree
cpcmener: -0.02056789 hartree
kineticenergy: 1578.92109960 hartree
xcener: -118.038178088209 hartree
chargesum: 0.0000000
charge: -0.423092 0.711390 -0.321547 -0.354036 -0.336576 -0.390755 -0.348279 0.290896 -0.338091 -0.319860 -0.337537 0.250743 0.126293 0.219058 -0.003957 0.002557 -0.238277 -0.255399 0.047696 -0.248762 0.097015 0.103257 0.096116 0.094403 0.091539 0.097957 0.095241 0.095695 0.103444 0.075056 0.138363 0.141923 0.099255 0.083441 0.094874 0.092034 0.094850 0.098612 0.095653 0.106913 0.080136 0.100781 0.090974
qa: -0.4231 0.7114 -0.3215 -0.3540 -0.3366 -0.3908 -0.3483 0.2909 -0.3381 -0.3199 -0.3375 0.2507 0.1263 0.2191 -0.0040 0.0026 -0.2383 -0.2554 0.0477 -0.2488 0.0970 0.1033 0.0961 0.0944 0.0915 0.0980 0.0952 0.0957 0.1034 0.0751 0.1384 0.1419 0.0993 0.0834 0.0949 0.0920 0.0949 0.0986 0.0957 0.1069 0.0801 0.1008 0.0910
va: 2.0175 5.5333 2.1215 2.1205 2.0624 3.0519 3.0824 3.6329 3.9325 3.9261 3.9323 3.9515 3.8606 3.7458 4.1070 4.1038 3.8755 3.9242 3.8263 3.9402 1.0167 1.0027 1.0028 1.0115 1.0131 1.0025 1.0186 1.0033 1.0028 1.0172 1.0105 1.0021 1.0098 1.0168 1.0087 1.0061 1.0070 1.0079 1.0046 0.9929 1.0167 1.0099 1.0022
dispcorr: -0.021371383 hartree
energy: -1584.217377376635
dipole: -14.84504 15.16286 0.31783 4.36941 -4.42732 -0.05791 -19.13260 17.76087 -1.37173
magnitude: 1.40926 au
magnitude: 3.58206 debye
