program: Orca
programVersion: 5.0.2
elementType: S P O O O N N C C C C C C C C C C C C C H H H H H H H H H H H H H H H H H H H H H H H
charge: 0
multiplicity: 1
keywords: wb97x-d3
keywords: def2-TZVPP
keywords: def2/J RIJCOSX
keywords: DEFGRID2
keywords: scfconv7
keywords: smallprint printgap noloewdin
keywords: NOSOSCF
formula: C13H23N2O3PS
InChI: InChI=1/C13H23N2O3PS/c1-7-16-19(20,17-10(2)3)18-11-8-14-12(15-9-11)13(4,5)6/h8-10H,7H2,1-6H3
43 atoms
S  1.768626 0.38191 2.359607
P  1.936567 -0.298401 0.5788
O  1.893181 0.761684 -0.607327
O  0.763281 -1.30871 0.069557
O  3.21582 -1.210704 0.387988
N  -2.65034 -0.620732 1.022728
N  -2.320605 0.075319 -1.195849
C  -4.514521 0.396976 -0.210333
C  -5.208376 -0.348989 -1.356205
C  -4.509797 1.899882 -0.515679
C  -5.281262 0.150675 1.085161
C  -3.077829 -0.082833 -0.1113
C  2.400294 2.118448 -0.508549
C  -0.5351 -0.876017 0.012293
C  -1.386522 -1.014996 1.090152
C  -1.060652 -0.314544 -1.139629
C  3.913354 2.113744 -0.484427
C  1.828485 2.862949 -1.693168
C  3.58402 -1.850869 -0.858253
C  3.251396 -3.321246 -0.825345
H  -4.717263 -0.170463 -2.312895
H  -6.243885 -0.014905 -1.446651
H  -5.224822 -1.426957 -1.182277
H  -4.019798 2.46963 0.276603
H  -3.999585 2.12088 -1.453557
H  -5.534417 2.267362 -0.600214
H  -5.33235 -0.908864 1.33858
H  -6.305692 0.511838 0.975678
H  -4.837492 0.674073 1.932757
H  2.016157 2.551393 0.419148
H  -1.048043 -1.464583 2.017588
H  -0.454278 -0.192782 -2.031348
H  4.322467 1.62519 -1.370476
H  4.280483 3.140317 -0.466098
H  4.308034 1.615072 0.402053
H  2.128365 3.909838 -1.645769
H  0.738244 2.829551 -1.695844
H  2.191305 2.45215 -2.636918
H  3.106359 -1.355378 -1.705424
H  4.658226 -1.696752 -0.952967
H  3.712849 -3.816144 0.029436
H  2.177246 -3.499928 -0.794399
H  3.640086 -3.791184 -1.729755
elementType: S P O N C H
totalener: -1584.19683580 hartree
nucrepener: 2013.04814636 hartree
electener: -3597.24498216 hartree
oneelecener: -6174.98826726 hartree
twoeener: 2577.74328510 hartree
cpcmener: -0.02084370 hartree
kineticenergy: 1578.90647687 hartree
xcener: -118.035378239800 hartree
chargesum: 0.0000000
charge: -0.423861 0.707389 -0.330533 -0.350497 -0.337907 -0.344075 -0.391600 0.291326 -0.337993 -0.338094 -0.319204 0.250951 0.140562 0.229295 -0.007444 -0.007061 -0.250129 -0.255232 0.042432 -0.244575 0.095919 0.095586 0.103301 0.103931 0.096244 0.095960 0.092939 0.097231 0.092766 0.075019 0.138360 0.140754 0.093114 0.104198 0.091413 0.095260 0.098946 0.090158 0.099885 0.107257 0.088026 0.085329 0.094653
qa: -0.4239 0.7074 -0.3305 -0.3505 -0.3379 -0.3441 -0.3916 0.2913 -0.3380 -0.3381 -0.3192 0.2510 0.1406 0.2293 -0.0074 -0.0071 -0.2501 -0.2552 0.0424 -0.2446 0.0959 0.0956 0.1033 0.1039 0.0962 0.0960 0.0929 0.0972 0.0928 0.0750 0.1384 0.1408 0.0931 0.1042 0.0914 0.0953 0.0989 0.0902 0.0999 0.1073 0.0880 0.0853 0.0947
va: 2.0307 5.5390 2.0740 2.0873 2.1086 3.0819 3.0450 3.6359 3.9322 3.9327 3.9275 3.9528 3.8389 3.7019 4.1185 4.1126 3.8846 3.9324 3.8378 3.9476 1.0179 1.0032 1.0026 1.0026 1.0172 1.0029 1.0121 1.0027 1.0124 1.0233 1.0136 1.0095 1.0064 1.0094 1.0207 1.0069 1.0064 1.0066 1.0025 0.9920 1.0042 1.0112 1.0070
dispcorr: -0.021395077 hartree
energy: -1584.218230873479
dipole: -11.72349 12.99055 1.26706 7.83541 -7.72522 0.11018 -14.82165 12.66112 -2.16053
magnitude: 2.50709 au
magnitude: 6.37251 debye
