program: Orca
programVersion: 5.0.2
elementType: S P O O O N N C C C C C C C C C C C C C H H H H H H H H H H H H H H H H H H H H H H H
charge: 0
multiplicity: 1
keywords: wb97x-d3
keywords: def2-TZVPP
keywords: def2/J RIJCOSX
keywords: DEFGRID2
keywords: scfconv7
keywords: smallprint printgap noloewdin
keywords: NOSOSCF
formula: C13H23N2O3PS
InChI: InChI=1/C13H23N2O3PS/c1-7-16-19(20,17-10(2)3)18-11-8-14-12(15-9-11)13(4,5)6/h8-10H,7H2,1-6H3
43 atoms
S  1.803648 -0.193983 1.936642
P  1.934562 -0.529045 0.050758
O  2.01264 0.712588 -0.92727
O  0.6822 -1.369661 -0.57732
O  3.1393 -1.414972 -0.470524
N  -2.566937 -0.683206 0.834342
N  -2.403432 0.376183 -1.255686
C  -4.437438 0.66604 0.088208
C  -5.420524 -0.469709 0.39187
C  -4.927705 1.446229 -1.128299
C  -4.362641 1.608338 1.296699
C  -3.054557 0.0863 -0.137566
C  2.182065 2.096106 -0.509968
C  -0.586953 -0.879309 -0.427495
C  -1.346146 -1.164504 0.695801
C  -1.17441 -0.099044 -1.402833
C  3.055409 2.75871 -1.550635
C  0.821458 2.742621 -0.376018
C  3.574296 -2.612189 0.211397
C  4.822089 -2.341264 1.012656
H  -5.128043 -1.03341 1.277385
H  -5.49448 -1.169246 -0.44332
H  -6.417834 -0.063394 0.570621
H  -5.92437 1.844362 -0.929213
H  -4.278801 2.289533 -1.366574
H  -4.996007 0.81861 -2.018072
H  -5.344068 2.043304 1.495251
H  -3.666622 2.431371 1.121363
H  -4.042306 1.084692 2.19808
H  2.690792 2.106735 0.457093
H  -0.958317 -1.795986 1.487861
H  -0.648814 0.14282 -2.321112
H  3.234284 3.796036 -1.26712
H  4.02423 2.265156 -1.633545
H  2.578781 2.757258 -2.532413
H  0.940134 3.780564 -0.062748
H  0.210005 2.240399 0.374719
H  0.282919 2.738655 -1.325028
H  2.778584 -3.00711 0.846717
H  3.760438 -3.344147 -0.573627
H  5.177338 -3.274701 1.44917
H  5.619203 -1.941686 0.385717
H  4.632365 -1.641191 1.825145
elementType: S P O N C H
totalener: -1584.19549838 hartree
nucrepener: 2021.40804845 hartree
electener: -3605.60354682 hartree
oneelecener: -6191.89872085 hartree
twoeener: 2586.29517402 hartree
cpcmener: -0.01851468 hartree
kineticenergy: 1578.92702894 hartree
xcener: -118.040710817743 hartree
chargesum: -0.0000000
charge: -0.442902 0.749546 -0.348956 -0.350921 -0.342704 -0.384402 -0.342327 0.293355 -0.336689 -0.321328 -0.340230 0.246679 0.175756 0.239266 -0.008293 -0.027334 -0.249696 -0.266733 0.041443 -0.235040 0.096339 0.102185 0.095521 0.098147 0.091418 0.094548 0.096293 0.103519 0.097561 0.066273 0.136549 0.144039 0.091020 0.096613 0.089965 0.114690 0.087252 0.093336 0.090138 0.106069 0.094394 0.089482 0.076156
qa: -0.4429 0.7495 -0.3490 -0.3509 -0.3427 -0.3844 -0.3423 0.2934 -0.3367 -0.3213 -0.3402 0.2467 0.1758 0.2393 -0.0083 -0.0273 -0.2497 -0.2667 0.0414 -0.2350 0.0963 0.1022 0.0955 0.0981 0.0914 0.0945 0.0963 0.1035 0.0976 0.0663 0.1365 0.1440 0.0910 0.0966 0.0900 0.1147 0.0873 0.0933 0.0901 0.1061 0.0944 0.0895 0.0762
va: 1.9750 5.5171 2.1179 2.0906 2.1241 3.0515 3.0581 3.6303 3.9278 3.9287 3.9355 3.9586 3.7896 3.7085 4.1200 4.0863 3.9418 3.9016 3.8658 3.9275 1.0193 1.0028 1.0031 1.0027 1.0131 1.0111 1.0032 1.0029 1.0158 1.0258 1.0144 1.0094 1.0051 1.0093 1.0069 1.0082 1.0156 1.0044 1.0044 0.9955 1.0083 1.0039 1.0187
dispcorr: -0.021578176 hartree
energy: -1584.217076553814
dipole: -12.01599 13.11092 1.09492 12.75750 -12.67705 0.08045 -1.25832 0.71254 -0.54578
magnitude: 1.22605 au
magnitude: 3.11638 debye
