program: Orca
programVersion: 5.0.2
elementType: S P O O O N N C C C C C C C C C C C C C H H H H H H H H H H H H H H H H H H H H H H H
charge: 0
multiplicity: 1
keywords: wb97x-d3
keywords: def2-TZVPP
keywords: def2/J RIJCOSX
keywords: DEFGRID2
keywords: scfconv7
keywords: smallprint printgap noloewdin
keywords: NOSOSCF
formula: C13H23N2O3PS
InChI: InChI=1/C13H23N2O3PS/c1-7-16-19(20,17-10(2)3)18-11-8-14-12(15-9-11)13(4,5)6/h8-10H,7H2,1-6H3
43 atoms
S  3.635714 -0.606175 1.478169
P  2.029403 -0.261131 0.497661
O  1.665702 1.234831 0.122927
O  0.707621 -0.653098 1.357676
O  1.86373 -1.01193 -0.898884
N  -2.444352 0.968504 0.664419
N  -2.479986 -1.188413 -0.261706
C  -4.448782 0.256348 -0.504434
C  -5.042789 -0.964482 -1.200779
C  -4.399881 1.427121 -1.493651
C  -5.331323 0.639064 0.689531
C  -3.040985 -0.014644 -0.008307
C  2.53159 2.076977 -0.689195
C  -0.554639 -0.426598 0.868111
C  -1.214891 0.769445 1.100638
C  -1.244113 -1.397246 0.170859
C  1.646733 2.765368 -1.703415
C  3.25589 3.041426 0.222637
C  2.588582 -2.205357 -1.255398
C  2.000799 -3.445402 -0.630567
H  -5.110801 -1.825188 -0.534078
H  -4.46074 -1.265872 -2.072297
H  -6.053011 -0.733014 -1.543515
H  -4.006189 2.332261 -1.030372
H  -3.777858 1.194773 -2.360559
H  -5.403914 1.650645 -1.859554
H  -6.351463 0.834561 0.353472
H  -4.968152 1.537053 1.189261
H  -5.375944 -0.16323 1.42901
H  3.260163 1.448996 -1.211252
H  -0.741626 1.571932 1.656905
H  -0.800587 -2.366004 -0.033069
H  0.895059 3.387499 -1.214032
H  2.251272 3.410728 -2.340967
H  1.137508 2.045285 -2.344439
H  3.894234 3.698146 -0.369154
H  3.890482 2.515217 0.935798
H  2.55174 3.664896 0.776101
H  2.532459 -2.251813 -2.342045
H  3.637731 -2.086919 -0.978068
H  2.554369 -4.315517 -0.985784
H  2.075043 -3.429718 0.457374
H  0.956236 -3.582076 -0.910043
elementType: S P O N C H
totalener: -1584.19565169 hartree
nucrepener: 2019.22243787 hartree
electener: -3603.41808956 hartree
oneelecener: -6187.21502544 hartree
twoeener: 2583.79693588 hartree
cpcmener: -0.02038255 hartree
kineticenergy: 1578.91517506 hartree
xcener: -118.037832200885 hartree
chargesum: 0.0000000
charge: -0.423529 0.717089 -0.334231 -0.349188 -0.339293 -0.387635 -0.350049 0.287669 -0.321157 -0.337830 -0.336645 0.250307 0.135253 0.224775 -0.005065 -0.008642 -0.253870 -0.242555 0.050058 -0.258876 0.094133 0.092221 0.097887 0.096553 0.103443 0.096178 0.095354 0.096631 0.103059 0.075815 0.136840 0.152878 0.090606 0.097064 0.096733 0.095602 0.084960 0.090669 0.109001 0.094514 0.106232 0.087631 0.089409
qa: -0.4235 0.7171 -0.3342 -0.3492 -0.3393 -0.3876 -0.3500 0.2877 -0.3212 -0.3378 -0.3366 0.2503 0.1353 0.2248 -0.0051 -0.0086 -0.2539 -0.2426 0.0501 -0.2589 0.0941 0.0922 0.0979 0.0966 0.1034 0.0962 0.0954 0.0966 0.1031 0.0758 0.1368 0.1529 0.0906 0.0971 0.0967 0.0956 0.0850 0.0907 0.1090 0.0945 0.1062 0.0876 0.0894
va: 2.0262 5.5253 2.1070 2.1078 2.0655 3.0471 3.0853 3.6347 3.9265 3.9338 3.9300 3.9560 3.8533 3.7380 4.1029 4.0990 3.9298 3.9289 3.8239 3.9145 1.0114 1.0129 1.0027 1.0164 1.0029 1.0030 1.0033 1.0182 1.0028 1.0081 1.0132 0.9967 1.0060 1.0073 1.0103 1.0073 1.0215 1.0062 0.9923 1.0147 1.0112 1.0149 1.0037
dispcorr: -0.021461041 hartree
energy: -1584.217112728484
dipole: -18.31718 18.62603 0.30886 7.05737 -6.89277 0.16460 -15.44831 13.78140 -1.66691
magnitude: 1.70325 au
magnitude: 4.32932 debye
