program: Orca
programVersion: 5.0.2
elementType: S P O O O N N C C C C C C C C C C C C C H H H H H H H H H H H H H H H H H H H H H H H
charge: 0
multiplicity: 1
keywords: wb97x-d3
keywords: def2-TZVPP
keywords: def2/J RIJCOSX
keywords: DEFGRID2
keywords: scfconv7
keywords: smallprint printgap noloewdin
keywords: NOSOSCF
formula: C13H23N2O3PS
InChI: InChI=1/C13H23N2O3PS/c1-7-16-19(20,17-10(2)3)18-11-8-14-12(15-9-11)13(4,5)6/h8-10H,7H2,1-6H3
43 atoms
S  1.536411 -0.888296 2.136044
P  1.94825 -0.31596 0.357279
O  2.349713 1.209457 0.261778
O  0.728843 -0.510975 -0.715481
O  3.10895 -1.048818 -0.437437
N  -2.82642 -0.781605 -0.983896
N  -2.357298 0.92913 0.548375
C  -4.694786 0.380143 0.042496
C  -5.328015 -0.939458 0.49828
C  -5.292844 0.788979 -1.308645
C  -4.992094 1.46384 1.07485
C  -3.20251 0.171315 -0.132616
C  2.629551 1.915675 -0.988087
C  -0.583887 -0.249074 -0.467888
C  -1.535859 -0.995335 -1.145865
C  -1.0560 0.731562 0.385617
C  1.747528 3.142681 -1.011055
C  4.104838 2.241892 -1.024198
C  3.270987 -2.485897 -0.425448
C  4.423566 -2.8724 0.464393
H  -5.168959 -1.736811 -0.227833
H  -6.405281 -0.814477 0.624507
H  -4.919911 -1.270275 1.455664
H  -5.123712 0.028988 -2.07203
H  -6.371255 0.931353 -1.214062
H  -4.866691 1.727913 -1.66848
H  -6.072477 1.583339 1.176729
H  -4.579567 2.431585 0.787754
H  -4.594628 1.213744 2.059323
H  2.377003 1.273027 -1.835339
H  -1.233687 -1.774854 -1.838571
H  -0.393453 1.38167 0.946305
H  1.927322 3.703901 -1.928616
H  0.68975 2.878001 -0.988153
H  1.96046 3.801297 -0.16762
H  4.336972 2.774753 -1.946974
H  4.717108 1.340406 -1.000317
H  4.391439 2.880186 -0.186982
H  2.347813 -2.973737 -0.10614
H  3.454677 -2.770872 -1.460681
H  4.576715 -3.950645 0.403981
H  5.348524 -2.385772 0.153605
H  4.227183 -2.618119 1.505883
elementType: S P O N C H
totalener: -1584.19591944 hartree
nucrepener: 1995.75210964 hartree
electener: -3579.94802908 hartree
oneelecener: -6140.32811673 hartree
twoeener: 2560.38008765 hartree
cpcmener: -0.02157631 hartree
kineticenergy: 1578.90294046 hartree
xcener: -118.036340009117 hartree
chargesum: -0.0000000
charge: -0.418612 0.705981 -0.342590 -0.328355 -0.326427 -0.390590 -0.345238 0.292069 -0.336534 -0.338043 -0.320819 0.241503 0.143015 0.261128 -0.021896 0.001057 -0.253269 -0.254641 0.029170 -0.231154 0.095514 0.094954 0.102829 0.095944 0.095643 0.102677 0.097543 0.091704 0.093767 0.081775 0.136288 0.115853 0.098997 0.098335 0.093339 0.095639 0.092572 0.090928 0.091326 0.108045 0.094191 0.089624 0.076758
qa: -0.4186 0.7060 -0.3426 -0.3284 -0.3264 -0.3906 -0.3452 0.2921 -0.3365 -0.3380 -0.3208 0.2415 0.1430 0.2611 -0.0219 0.0011 -0.2533 -0.2546 0.0292 -0.2312 0.0955 0.0950 0.1028 0.0959 0.0956 0.1027 0.0975 0.0917 0.0938 0.0818 0.1363 0.1159 0.0990 0.0983 0.0933 0.0956 0.0926 0.0909 0.0913 0.1080 0.0942 0.0896 0.0768
va: 2.0210 5.5233 2.1012 2.0768 2.1040 3.0533 3.0873 3.6329 3.9328 3.9338 3.9276 3.9569 3.8369 3.6699 4.1213 4.0594 3.9200 3.9305 3.8595 3.9318 1.0182 1.0035 1.0025 1.0170 1.0032 1.0026 1.0025 1.0128 1.0118 1.0084 1.0074 1.0304 1.0072 1.0032 1.0075 1.0058 1.0153 1.0064 1.0054 0.9955 1.0081 1.0041 1.0179
dispcorr: -0.020955859 hartree
energy: -1584.216875300873
dipole: -10.53741 11.87390 1.33649 7.12884 -7.10030 0.02854 -7.66091 5.59081 -2.07010
magnitude: 2.46421 au
magnitude: 6.26353 debye
