program: Orca
programVersion: 5.0.2
elementType: S P O O O N N C C C C C C C C C C C C C H H H H H H H H H H H H H H H H H H H H H H H
charge: 0
multiplicity: 1
keywords: wb97x-d3
keywords: def2-TZVPP
keywords: def2/J RIJCOSX
keywords: DEFGRID2
keywords: scfconv7
keywords: smallprint printgap noloewdin
keywords: NOSOSCF
formula: C13H23N2O3PS
InChI: InChI=1/C13H23N2O3PS/c1-7-16-19(20,17-10(2)3)18-11-8-14-12(15-9-11)13(4,5)6/h8-10H,7H2,1-6H3
43 atoms
S  1.491449 -1.266912 1.970341
P  1.945873 -0.379338 0.337714
O  2.365632 1.133416 0.524204
O  0.755664 -0.356157 -0.783484
O  3.12108 -0.976063 -0.545362
N  -2.798297 -0.632694 -1.138842
N  -2.363062 0.851759 0.622593
C  -4.679894 0.411146 0.045952
C  -4.975487 1.914691 0.059416
C  -5.050532 -0.190214 1.407449
C  -5.518993 -0.253206 -1.042046
C  -3.194731 0.194357 -0.181562
C  2.694568 2.021161 -0.595043
C  -0.56628 -0.159809 -0.520611
C  -1.496974 -0.813784 -1.305072
C  -1.06317 0.687303 0.460296
C  1.755748 3.202462 -0.527125
C  4.15116 2.400706 -0.469037
C  3.242326 -2.395216 -0.804763
C  4.374444 -2.976821 -0.000198
H  -4.42672 2.429658 0.847411
H  -6.040354 2.084595 0.229726
H  -4.715544 2.382599 -0.892487
H  -4.495805 0.278605 2.22124
H  -6.115018 -0.045782 1.604152
H  -4.8521 -1.263609 1.440057
H  -5.29122 0.140183 -2.033916
H  -6.577037 -0.064093 -0.850117
H  -5.379318 -1.333974 -1.071966
H  2.538721 1.492987 -1.538835
H  -1.177958 -1.491934 -2.090469
H  -0.412813 1.250237 1.12146
H  1.863952 3.745585 0.413024
H  1.980501 3.892091 -1.341395
H  0.714714 2.895132 -0.634542
H  4.34757 2.925583 0.4671
H  4.426066 3.063637 -1.290207
H  4.798541 1.524913 -0.520205
H  2.302989 -2.907456 -0.585709
H  3.426474 -2.48612 -1.874723
H  4.17671 -2.917079 1.070221
H  4.494979 -4.029211 -0.261515
H  5.317101 -2.470807 -0.212096
elementType: S P O N C H
totalener: -1584.19595928 hartree
nucrepener: 1996.80553242 hartree
electener: -3581.00149171 hartree
oneelecener: -6142.42477811 hartree
twoeener: 2561.42328641 hartree
cpcmener: -0.02169503 hartree
kineticenergy: 1578.89395476 hartree
xcener: -118.033924501329 hartree
chargesum: 0.0000000
charge: -0.417854 0.704631 -0.343901 -0.328082 -0.327133 -0.349497 -0.387025 0.289541 -0.334461 -0.337671 -0.319895 0.243566 0.145818 0.257274 -0.018602 -0.001930 -0.254554 -0.253397 0.030245 -0.231347 0.094897 0.094768 0.101878 0.096694 0.096107 0.103807 0.095653 0.097171 0.090321 0.077946 0.135583 0.118431 0.093568 0.100607 0.098401 0.091123 0.095525 0.092768 0.090133 0.107658 0.077766 0.093817 0.089654
qa: -0.4179 0.7046 -0.3439 -0.3281 -0.3271 -0.3495 -0.3870 0.2895 -0.3345 -0.3377 -0.3199 0.2436 0.1458 0.2573 -0.0186 -0.0019 -0.2546 -0.2534 0.0302 -0.2313 0.0949 0.0948 0.1019 0.0967 0.0961 0.1038 0.0957 0.0972 0.0903 0.0779 0.1356 0.1184 0.0936 0.1006 0.0984 0.0911 0.0955 0.0928 0.0901 0.1077 0.0778 0.0938 0.0897
va: 2.0232 5.5221 2.0996 2.0696 2.0996 3.0810 3.0654 3.6371 3.9265 3.9335 3.9265 3.9542 3.8378 3.6719 4.1102 4.0850 3.9183 3.9321 3.8592 3.9330 1.0205 1.0036 1.0033 1.0147 1.0025 1.0032 1.0104 1.0029 1.0143 1.0095 1.0080 1.0273 1.0075 1.0074 1.0035 1.0066 1.0055 1.0143 1.0058 0.9958 1.0171 1.0080 1.0042
dispcorr: -0.021031855 hartree
energy: -1584.216991135946
dipole: -10.41041 11.77751 1.36710 8.56594 -8.15160 0.41434 -6.18931 4.23744 -1.95188
magnitude: 2.41877 au
magnitude: 6.14803 debye
