program: Orca
programVersion: 5.0.2
elementType: S P O O O N N C C C C C C C C C C C C C H H H H H H H H H H H H H H H H H H H H H H H
charge: 0
multiplicity: 1
keywords: wb97x-d3
keywords: def2-TZVPP
keywords: def2/J RIJCOSX
keywords: DEFGRID2
keywords: scfconv7
keywords: smallprint printgap noloewdin
keywords: NOSOSCF
formula: C13H23N2O3PS
InChI: InChI=1/C13H23N2O3PS/c1-7-16-19(20,17-10(2)3)18-11-8-14-12(15-9-11)13(4,5)6/h8-10H,7H2,1-6H3
43 atoms
S  1.741883 -0.042742 1.841639
P  1.926649 -0.274043 -0.055749
O  1.916204 0.989313 -1.009941
O  0.721202 -1.124067 -0.755924
O  3.188073 -1.092862 -0.563947
N  -2.576053 -0.97152 0.706517
N  -2.471289 0.526822 -1.099186
C  -4.544796 0.387254 0.149957
C  -5.353283 0.158754 -1.13216
C  -4.542604 1.883583 0.486243
C  -5.190674 -0.385888 1.295635
C  -3.112076 -0.053627 -0.086579
C  2.564352 2.277023 -0.804593
C  -0.578207 -0.75481 -0.528884
C  -1.315884 -1.321342 0.491914
C  -1.21629 0.183515 -1.323049
C  1.710092 3.159014 0.079687
C  3.990983 2.135007 -0.319628
C  3.823034 -2.133841 0.206368
C  3.007719 -3.402112 0.254004
H  -5.376267 -0.897293 -1.408908
H  -4.9447 0.717839 -1.973777
H  -6.385271 0.483624 -0.986585
H  -3.982744 2.088432 1.401064
H  -4.104877 2.477889 -0.316227
H  -5.565059 2.233938 0.640128
H  -5.218599 -1.458712 1.101981
H  -6.220109 -0.047602 1.427523
H  -4.670166 -0.232329 2.241265
H  2.577824 2.695066 -1.811999
H  -0.884171 -2.076387 1.140478
H  -0.705532 0.656174 -2.155467
H  1.690399 2.80874 1.110851
H  2.117713 4.170502 0.074498
H  0.68521 3.214597 -0.289132
H  4.048033 1.72959 0.69127
H  4.452881 3.122512 -0.30228
H  4.583691 1.50896 -0.986583
H  4.774549 -2.302499 -0.295035
H  4.032644 -1.760751 1.210561
H  2.770016 -3.766288 -0.745472
H  3.590501 -4.17283 0.759832
H  2.080065 -3.274934 0.812478
elementType: S P O N C H
totalener: -1584.19252096 hartree
nucrepener: 2023.81317983 hartree
electener: -3608.00570079 hartree
oneelecener: -6197.03301204 hartree
twoeener: 2589.02731125 hartree
cpcmener: -0.01853990 hartree
kineticenergy: 1578.91918186 hartree
xcener: -118.042346639741 hartree
chargesum: 0.0000000
charge: -0.437351 0.753713 -0.349855 -0.357018 -0.342809 -0.345027 -0.390150 0.288899 -0.336682 -0.338326 -0.317085 0.250881 0.159315 0.220429 -0.005443 -0.002106 -0.273642 -0.272136 0.036507 -0.234433 0.102616 0.095970 0.095131 0.103650 0.096526 0.096065 0.093340 0.097335 0.091079 0.085576 0.137285 0.140085 0.088732 0.102999 0.100037 0.087470 0.102406 0.105266 0.109603 0.093781 0.091306 0.098671 0.077391
qa: -0.4374 0.7537 -0.3499 -0.3570 -0.3428 -0.3450 -0.3902 0.2889 -0.3367 -0.3383 -0.3171 0.2509 0.1593 0.2204 -0.0054 -0.0021 -0.2736 -0.2721 0.0365 -0.2344 0.1026 0.0960 0.0951 0.1037 0.0965 0.0961 0.0933 0.0973 0.0911 0.0856 0.1373 0.1401 0.0887 0.1030 0.1000 0.0875 0.1024 0.1053 0.1096 0.0938 0.0913 0.0987 0.0774
va: 1.9785 5.5095 2.1295 2.0954 2.1137 3.0819 3.0435 3.6379 3.9310 3.9329 3.9268 3.9541 3.8564 3.7294 4.1119 4.1190 3.9314 3.8946 3.8493 3.9096 1.0029 1.0189 1.0033 1.0029 1.0170 1.0029 1.0119 1.0028 1.0133 0.9916 1.0094 1.0114 1.0160 1.0080 1.0057 1.0217 1.0078 1.0099 0.9915 1.0114 1.0065 1.0091 1.0138
dispcorr: -0.021563965 hartree
energy: -1584.214084922389
dipole: -11.58362 13.16829 1.58467 7.79293 -7.58108 0.21185 1.14552 -1.84844 -0.70292
magnitude: 1.74647 au
magnitude: 4.43918 debye
