program: Orca
programVersion: 5.0.2
elementType: S P O O O N N C C C C C C C C C C C C C H H H H H H H H H H H H H H H H H H H H H H H
charge: 0
multiplicity: 1
keywords: wb97x-d3
keywords: def2-TZVPP
keywords: def2/J RIJCOSX
keywords: DEFGRID2
keywords: scfconv7
keywords: smallprint printgap noloewdin
keywords: NOSOSCF
formula: C13H23N2O3PS
InChI: InChI=1/C13H23N2O3PS/c1-7-16-19(20,17-10(2)3)18-11-8-14-12(15-9-11)13(4,5)6/h8-10H,7H2,1-6H3
43 atoms
S  1.772149 0.094326 1.830431
P  1.9324 -0.268908 -0.048079
O  1.895034 0.923478 -1.088665
O  0.727828 -1.17947 -0.666102
O  3.195513 -1.110427 -0.514022
N  -2.553441 -0.903981 0.813551
N  -2.483126 0.401379 -1.137676
C  -4.541488 0.372265 0.14607
C  -4.556949 1.898388 0.296275
C  -5.153496 -0.261063 1.391701
C  -5.368595 -0.026094 -1.081696
C  -3.107049 -0.076997 -0.06309
C  2.5300 2.22943 -0.972569
C  -0.57205 -0.799589 -0.461204
C  -1.292696 -1.263958 0.6211
C  -1.22695 0.047762 -1.339312
C  1.671187 3.1592 -0.143072
C  3.960891 2.134725 -0.487481
C  3.844762 -2.087799 0.32412
C  3.042795 -3.358049 0.45947
H  -4.152129 2.396073 -0.585239
H  -3.975816 2.221923 1.162356
H  -5.580807 2.250525 0.436645
H  -6.184322 0.080087 1.504818
H  -5.171291 -1.349953 1.333201
H  -4.614973 0.013087 2.299623
H  -6.403796 0.297547 -0.957097
H  -5.376929 -1.108597 -1.225397
H  -4.985412 0.431172 -1.993964
H  2.534063 2.580888 -2.004985
H  -0.848007 -1.945958 1.338186
H  -0.729202 0.437195 -2.221422
H  1.662834 2.879888 0.909804
H  2.066839 4.172601 -0.219704
H  0.643055 3.178549 -0.506474
H  4.028139 1.800411 0.548796
H  4.413454 3.125504 -0.540139
H  4.557071 1.47029 -1.11302
H  4.798159 -2.278761 -0.165564
H  4.050751 -1.644953 1.30048
H  2.806313 -3.790572 -0.512733
H  3.632662 -4.087826 1.015182
H  2.114618 -3.201899 1.010031
elementType: S P O N C H
totalener: -1584.19249507 hartree
nucrepener: 2024.63093135 hartree
electener: -3608.82342642 hartree
oneelecener: -6198.66231573 hartree
twoeener: 2589.83888930 hartree
cpcmener: -0.01845436 hartree
kineticenergy: 1578.92359899 hartree
xcener: -118.043057781328 hartree
chargesum: -0.0000000
charge: -0.437709 0.755784 -0.350732 -0.357170 -0.343162 -0.344942 -0.391046 0.289960 -0.337902 -0.318476 -0.337644 0.250322 0.160550 0.221098 -0.004795 -0.002434 -0.274273 -0.273611 0.036367 -0.234582 0.096278 0.103674 0.096096 0.097671 0.093016 0.092074 0.095520 0.103133 0.096046 0.085271 0.136665 0.140020 0.089064 0.103092 0.099903 0.088076 0.102552 0.105596 0.109519 0.093870 0.091453 0.098410 0.077399
qa: -0.4377 0.7558 -0.3507 -0.3572 -0.3432 -0.3449 -0.3910 0.2900 -0.3379 -0.3185 -0.3376 0.2503 0.1606 0.2211 -0.0048 -0.0024 -0.2743 -0.2736 0.0364 -0.2346 0.0963 0.1037 0.0961 0.0977 0.0930 0.0921 0.0955 0.1031 0.0960 0.0853 0.1367 0.1400 0.0891 0.1031 0.0999 0.0881 0.1026 0.1056 0.1095 0.0939 0.0915 0.0984 0.0774
va: 1.9786 5.5085 2.1296 2.0962 2.1136 3.0815 3.0437 3.6350 3.9326 3.9268 3.9314 3.9542 3.8562 3.7283 4.1111 4.1194 3.9321 3.8936 3.8493 3.9105 1.0174 1.0028 1.0029 1.0026 1.0123 1.0128 1.0031 1.0026 1.0183 0.9917 1.0102 1.0113 1.0160 1.0077 1.0059 1.0218 1.0077 1.0099 0.9916 1.0117 1.0066 1.0091 1.0136
dispcorr: -0.021550676 hartree
energy: -1584.214045748243
dipole: -11.71045 13.27171 1.56127 7.81923 -7.64383 0.17540 0.62371 -1.34888 -0.72517
magnitude: 1.73037 au
magnitude: 4.39826 debye
