program: Orca
programVersion: 5.0.2
elementType: S P O O O N N C C C C C C C C C C C C C H H H H H H H H H H H H H H H H H H H H H H H
charge: 0
multiplicity: 1
keywords: wb97x-d3
keywords: def2-TZVPP
keywords: def2/J RIJCOSX
keywords: DEFGRID2
keywords: scfconv7
keywords: smallprint printgap noloewdin
keywords: NOSOSCF
formula: C13H23N2O3PS
InChI: InChI=1/C13H23N2O3PS/c1-7-16-19(20,17-10(2)3)18-11-8-14-12(15-9-11)13(4,5)6/h8-10H,7H2,1-6H3
43 atoms
S  1.806298 -0.579752 1.893422
P  1.944385 -0.172473 0.025352
O  2.114167 1.345034 -0.402125
O  0.651998 -0.55827 -0.880705
O  3.098108 -0.894197 -0.791554
N  -2.896707 -0.997918 -0.870266
N  -2.404395 0.825405 0.516738
C  -4.747545 0.194085 0.161447
C  -5.351668 0.710638 -1.151471
C  -5.018589 1.20555 1.271867
C  -5.399978 -1.142465 0.525919
C  -3.259312 -0.005459 -0.059178
C  3.177593 2.176717 0.1451
C  -0.651008 -0.338046 -0.549009
C  -1.611197 -1.169564 -1.106466
C  -1.109391 0.673361 0.275121
C  3.924504 2.772359 -1.025759
C  2.547458 3.211153 1.049046
C  3.612772 -2.199636 -0.459725
C  2.644503 -3.307466 -0.791748
H  -6.426668 0.8645 -1.036913
H  -5.202521 0.003935 -1.969015
H  -4.911075 1.665071 -1.446861
H  -4.604822 2.188363 1.046648
H  -6.096074 1.323459 1.40224
H  -4.605425 0.882845 2.228881
H  -5.268158 -1.887547 -0.258066
H  -6.472637 -1.004397 0.675441
H  -4.989066 -1.551883 1.451208
H  3.860444 1.552589 0.729879
H  -1.320498 -1.983547 -1.763559
H  -0.442436 1.384447 0.749483
H  3.270282 3.392853 -1.640261
H  4.738176 3.399855 -0.661716
H  4.359261 1.995932 -1.655974
H  1.827604 3.825553 0.505639
H  3.318183 3.870417 1.449176
H  2.039915 2.743287 1.893029
H  4.524757 -2.290779 -1.047177
H  3.889324 -2.219876 0.596136
H  1.7547 -3.279895 -0.161741
H  2.336084 -3.273944 -1.836777
H  3.135873 -4.265973 -0.620062
elementType: S P O N C H
totalener: -1584.19602168 hartree
nucrepener: 1993.84952842 hartree
electener: -3578.04555010 hartree
oneelecener: -6136.80746879 hartree
twoeener: 2558.76191868 hartree
cpcmener: -0.01910515 hartree
kineticenergy: 1578.91158378 hartree
xcener: -118.039307505401 hartree
chargesum: 0.0000000
charge: -0.434855 0.736038 -0.347928 -0.320665 -0.342733 -0.386617 -0.354070 0.283410 -0.339344 -0.318092 -0.332982 0.243743 0.151459 0.242657 -0.010494 0.013637 -0.247533 -0.254613 0.031783 -0.238168 0.096607 0.097665 0.104210 0.089650 0.097547 0.096375 0.094130 0.094829 0.101362 0.068537 0.136413 0.112919 0.089465 0.093183 0.094044 0.092866 0.103137 0.088014 0.109224 0.095031 0.079744 0.091532 0.098881
qa: -0.4349 0.7360 -0.3479 -0.3207 -0.3427 -0.3866 -0.3541 0.2834 -0.3393 -0.3181 -0.3330 0.2437 0.1515 0.2427 -0.0105 0.0136 -0.2475 -0.2546 0.0318 -0.2382 0.0966 0.0977 0.1042 0.0896 0.0975 0.0964 0.0941 0.0948 0.1014 0.0685 0.1364 0.1129 0.0895 0.0932 0.0940 0.0929 0.1031 0.0880 0.1092 0.0950 0.0797 0.0915 0.0989
va: 1.9850 5.5152 2.1053 2.1395 2.1251 3.0560 3.0938 3.6396 3.9346 3.9230 3.9271 3.9592 3.8446 3.7131 4.0982 4.0741 3.9451 3.9097 3.8589 3.8954 1.0030 1.0136 1.0032 1.0160 1.0027 1.0102 1.0210 1.0035 1.0034 1.0142 1.0075 1.0249 1.0073 1.0061 1.0114 1.0069 1.0086 1.0176 0.9920 1.0099 1.0167 1.0061 1.0093
dispcorr: -0.020652431 hartree
energy: -1584.216674114133
dipole: -11.75348 13.52887 1.77539 6.22167 -6.14171 0.07996 -1.48486 0.71562 -0.76924
magnitude: 1.93653 au
magnitude: 4.92226 debye
