program: Orca
programVersion: 5.0.2
elementType: S P O O O N N C C C C C C C C C C C C C H H H H H H H H H H H H H H H H H H H H H H H
charge: 0
multiplicity: 1
keywords: wb97x-d3
keywords: def2-TZVPP
keywords: def2/J RIJCOSX
keywords: DEFGRID2
keywords: scfconv7
keywords: smallprint printgap noloewdin
keywords: NOSOSCF
formula: C13H23N2O3PS
InChI: InChI=1/C13H23N2O3PS/c1-7-16-19(20,17-10(2)3)18-11-8-14-12(15-9-11)13(4,5)6/h8-10H,7H2,1-6H3
43 atoms
S  1.896666 0.087547 1.880326
P  1.94924 0.116788 -0.038136
O  3.16223 0.855532 -0.739506
O  0.709915 0.895009 -0.761223
O  1.915874 -1.279473 -0.794309
N  -2.548912 0.670187 0.780205
N  -2.476312 -0.76416 -1.078104
C  -4.520569 -0.683359 0.224647
C  -5.366618 -0.412091 -1.024516
C  -5.139761 0.038123 1.417748
C  -4.495989 -2.192049 0.501399
C  -3.097731 -0.222933 -0.032007
C  3.907538 1.943547 -0.125962
C  -0.577485 0.507988 -0.503681
C  -1.295672 1.036039 0.551092
C  -1.227637 -0.406846 -1.314863
C  5.229203 2.012509 -0.855143
C  3.117598 3.231974 -0.204337
C  2.098352 -2.557445 -0.150581
C  0.776987 -3.146668 0.273571
H  -5.397562 0.652454 -1.266029
H  -6.394197 -0.741616 -0.858563
H  -4.984883 -0.94335 -1.896426
H  -5.184006 1.117586 1.267716
H  -6.161509 -0.316061 1.567276
H  -4.589551 -0.145605 2.341205
H  -5.508453 -2.557534 0.683806
H  -3.896024 -2.428842 1.382628
H  -4.088304 -2.75015 -0.341993
H  4.082205 1.682125 0.921265
H  -0.857471 1.774132 1.214464
H  -0.730383 -0.845398 -2.173997
H  5.851047 2.786337 -0.404946
H  5.772236 1.069512 -0.785924
H  5.094136 2.261377 -1.909038
H  3.714979 4.048525 0.202456
H  2.196997 3.184983 0.37905
H  2.863835 3.481542 -1.235701
H  2.587133 -3.183115 -0.896327
H  2.777568 -2.457848 0.697802
H  0.094163 -3.250319 -0.57021
H  0.947986 -4.141374 0.687784
H  0.295137 -2.543808 1.043561
elementType: S P O N C H
totalener: -1584.19589176 hartree
nucrepener: 2015.57053531 hartree
electener: -3599.76642707 hartree
oneelecener: -6180.26593911 hartree
twoeener: 2580.49951204 hartree
cpcmener: -0.01834629 hartree
kineticenergy: 1578.91369704 hartree
xcener: -118.038753170341 hartree
chargesum: -0.0000000
charge: -0.442404 0.749951 -0.341430 -0.349547 -0.351322 -0.344081 -0.384220 0.289709 -0.338045 -0.316577 -0.339453 0.250074 0.134776 0.243182 -0.002728 -0.033799 -0.244963 -0.239872 0.050747 -0.251834 0.103086 0.095582 0.095954 0.093499 0.097493 0.091200 0.096418 0.103805 0.096454 0.073369 0.135217 0.145295 0.089511 0.096916 0.090141 0.099028 0.085246 0.093236 0.108598 0.091556 0.090941 0.108807 0.080485
qa: -0.4424 0.7500 -0.3414 -0.3495 -0.3513 -0.3441 -0.3842 0.2897 -0.3380 -0.3166 -0.3395 0.2501 0.1348 0.2432 -0.0027 -0.0338 -0.2450 -0.2399 0.0507 -0.2518 0.1031 0.0956 0.0960 0.0935 0.0975 0.0912 0.0964 0.1038 0.0965 0.0734 0.1352 0.1453 0.0895 0.0969 0.0901 0.0990 0.0852 0.0932 0.1086 0.0916 0.0909 0.1088 0.0805
va: 1.9798 5.5128 2.1413 2.0854 2.1094 3.0824 3.0361 3.6370 3.9308 3.9266 3.9329 3.9580 3.8445 3.7002 4.1102 4.1147 3.9295 3.8846 3.8346 3.9051 1.0028 1.0031 1.0184 1.0119 1.0028 1.0133 1.0033 1.0029 1.0167 1.0219 1.0126 1.0088 1.0055 1.0091 1.0069 1.0081 1.0190 1.0089 0.9948 1.0129 1.0029 1.0094 1.0151
dispcorr: -0.021444098 hartree
energy: -1584.217335854376
dipole: -12.83907 14.02506 1.18599 -3.96336 3.79015 -0.17321 -0.22618 -0.31012 -0.53631
magnitude: 1.31309 au
magnitude: 3.33761 debye
