program: Orca
programVersion: 5.0.2
elementType: S P O O O N N C C C C C C C C C C C C C H H H H H H H H H H H H H H H H H H H H H H H
charge: 0
multiplicity: 1
keywords: wb97x-d3
keywords: def2-TZVPP
keywords: def2/J RIJCOSX
keywords: DEFGRID2
keywords: scfconv7
keywords: smallprint printgap noloewdin
keywords: NOSOSCF
formula: C13H23N2O3PS
InChI: InChI=1/C13H23N2O3PS/c1-7-16-19(20,17-10(2)3)18-11-8-14-12(15-9-11)13(4,5)6/h8-10H,7H2,1-6H3
43 atoms
S  1.988606 0.216206 2.067479
P  1.812192 0.515099 0.180025
O  2.860794 1.47143 -0.522816
O  0.500637 1.353491 -0.29666
O  1.748817 -0.783336 -0.740173
N  -2.532659 -0.346754 -1.255427
N  -2.683656 0.264614 1.007346
C  -4.544202 -0.938055 0.022002
C  -5.545791 0.118632 0.501786
C  -4.46246 -2.066644 1.057323
C  -5.016729 -1.511822 -1.31022
C  -3.171254 -0.303221 -0.093915
C  4.254608 1.557648 -0.124837
C  -0.739953 0.781219 -0.218827
C  -1.321239 0.18671 -1.320733
C  -1.480629 0.80509 0.951264
C  4.991876 0.281898 -0.471658
C  4.81509 2.767753 -0.836202
C  1.769904 -2.140956 -0.255447
C  0.382653 -2.654625 0.033576
H  -5.633881 0.941286 -0.210899
H  -5.259856 0.538492 1.466141
H  -6.535814 -0.327811 0.613351
H  -5.439041 -2.540232 1.174782
H  -3.755403 -2.840446 0.750743
H  -4.15286 -1.69599 2.03494
H  -6.005662 -1.956498 -1.183914
H  -4.351299 -2.290911 -1.683717
H  -5.096745 -0.746239 -2.082766
H  4.28312 1.719851 0.956214
H  -0.804156 0.146323 -2.274109
H  -1.095245 1.277008 1.848916
H  6.047691 0.397507 -0.225894
H  4.625432 -0.576545 0.093743
H  4.916955 0.056242 -1.536429
H  4.257235 3.671433 -0.58935
H  4.802485 2.63588 -1.919561
H  5.849384 2.922122 -0.529409
H  2.243045 -2.716785 -1.049681
H  2.403685 -2.207968 0.630203
H  -0.089578 -2.109743 0.85171
H  -0.261777 -2.598021 -0.843358
H  0.449759 -3.7028 0.328317
elementType: S P O N C H
totalener: -1584.19544722 hartree
nucrepener: 2021.12985665 hartree
electener: -3605.32530388 hartree
oneelecener: -6191.19314966 hartree
twoeener: 2585.86784579 hartree
cpcmener: -0.01893551 hartree
kineticenergy: 1578.92380383 hartree
xcener: -118.041941797157 hartree
chargesum: 0.0000000
charge: -0.438304 0.720992 -0.332719 -0.349615 -0.340333 -0.340901 -0.384126 0.298092 -0.337919 -0.339507 -0.321780 0.245662 0.139676 0.232629 -0.021690 -0.012410 -0.246236 -0.249148 0.056882 -0.254775 0.102668 0.097212 0.095812 0.096405 0.102142 0.096711 0.098235 0.092736 0.093571 0.076131 0.142675 0.134476 0.100300 0.084603 0.095612 0.098565 0.090035 0.089826 0.111453 0.094094 0.079565 0.091947 0.110755
qa: -0.4383 0.7210 -0.3327 -0.3496 -0.3403 -0.3409 -0.3841 0.2981 -0.3379 -0.3395 -0.3218 0.2457 0.1397 0.2326 -0.0217 -0.0124 -0.2462 -0.2491 0.0569 -0.2548 0.1027 0.0972 0.0958 0.0964 0.1021 0.0967 0.0982 0.0927 0.0936 0.0761 0.1427 0.1345 0.1003 0.0846 0.0956 0.0986 0.0900 0.0898 0.1115 0.0941 0.0796 0.0919 0.1108
va: 1.9864 5.5400 2.1429 2.1161 2.0777 3.0541 3.0490 3.6290 3.9294 3.9334 3.9305 3.9479 3.8340 3.7108 4.0764 4.1160 3.8790 3.9360 3.8114 3.9355 1.0027 1.0186 1.0031 1.0033 1.0030 1.0173 1.0025 1.0120 1.0118 1.0201 1.0104 1.0136 1.0086 1.0165 1.0087 1.0084 1.0065 1.0054 0.9921 1.0117 1.0074 1.0054 1.0105
dispcorr: -0.022359653 hartree
energy: -1584.217806876688
dipole: -9.63422 11.00115 1.36692 -12.01518 11.29226 -0.72292 -4.40574 3.64087 -0.76487
magnitude: 1.72514 au
magnitude: 4.38497 debye
