program: Orca
programVersion: 5.0.2
elementType: S P O O O N N C C C C C C C C C C C C C H H H H H H H H H H H H H H H H H H H H H H H
charge: 0
multiplicity: 1
keywords: wb97x-d3
keywords: def2-TZVPP
keywords: def2/J RIJCOSX
keywords: DEFGRID2
keywords: scfconv7
keywords: smallprint printgap noloewdin
keywords: NOSOSCF
formula: C13H23N2O3PS
InChI: InChI=1/C13H23N2O3PS/c1-7-16-19(20,17-10(2)3)18-11-8-14-12(15-9-11)13(4,5)6/h8-10H,7H2,1-6H3
43 atoms
S  1.518888 0.198443 1.923334
P  1.761873 -0.034519 0.034181
O  3.033952 0.613969 -0.650042
O  0.589621 0.602634 -0.901122
O  1.789524 -1.522812 -0.517668
N  -2.739299 0.945489 0.441219
N  -2.685038 -0.919468 -0.985325
C  -4.778897 -0.33565 0.156163
C  -5.576544 0.923895 -0.201266
C  -4.911975 -0.610285 1.659224
C  -5.33734 -1.521974 -0.623924
C  -3.313335 -0.097723 -0.156776
C  3.54804 1.926436 -0.279081
C  -0.729277 0.350152 -0.63484
C  -1.460995 1.171249 0.208084
C  -1.39873 -0.702636 -1.224806
C  4.758763 1.734346 0.606201
C  3.856609 2.656392 -1.56611
C  2.362645 -2.622865 0.220349
C  3.869809 -2.570808 0.264227
H  -5.502578 1.156998 -1.265483
H  -5.232635 1.793601 0.358338
H  -6.632867 0.77548 0.03069
H  -4.359105 -1.504807 1.953307
H  -4.543467 0.224174 2.256355
H  -5.960071 -0.76942 1.919967
H  -6.391118 -1.656701 -0.373246
H  -4.820793 -2.451943 -0.385293
H  -5.272359 -1.372213 -1.70211
H  2.774455 2.469677 0.271124
H  -1.000554 2.027389 0.689796
H  -0.894397 -1.377028 -1.909306
H  4.497818 1.218655 1.530621
H  5.536156 1.164253 0.094878
H  5.175082 2.705585 0.875392
H  4.628153 2.14088 -2.140512
H  4.220779 3.658559 -1.339259
H  2.96757 2.757556 -2.189071
H  1.938584 -2.640719 1.226168
H  2.019668 -3.512347 -0.305119
H  4.23917 -1.727561 0.848803
H  4.236672 -3.481783 0.738739
H  4.30002 -2.518569 -0.736018
elementType: S P O N C H
totalener: -1584.19699379 hartree
nucrepener: 1995.09049774 hartree
electener: -3579.28749154 hartree
oneelecener: -6139.40826309 hartree
twoeener: 2560.12077156 hartree
cpcmener: -0.01885754 hartree
kineticenergy: 1578.91798301 hartree
xcener: -118.037928264901 hartree
chargesum: 0.0000000
charge: -0.439548 0.747510 -0.343939 -0.356478 -0.343671 -0.386218 -0.348685 0.290671 -0.337353 -0.337496 -0.317543 0.249230 0.164923 0.213289 -0.007090 0.005469 -0.254974 -0.248466 0.032545 -0.234591 0.102945 0.096414 0.095201 0.103388 0.097093 0.095676 0.097476 0.091383 0.093059 0.068103 0.138057 0.140159 0.088069 0.092563 0.101948 0.089289 0.092558 0.095681 0.094990 0.108619 0.078256 0.099309 0.092177
qa: -0.4395 0.7475 -0.3439 -0.3565 -0.3437 -0.3862 -0.3487 0.2907 -0.3374 -0.3375 -0.3175 0.2492 0.1649 0.2133 -0.0071 0.0055 -0.2550 -0.2485 0.0325 -0.2346 0.1029 0.0964 0.0952 0.1034 0.0971 0.0957 0.0975 0.0914 0.0931 0.0681 0.1381 0.1402 0.0881 0.0926 0.1019 0.0893 0.0926 0.0957 0.0950 0.1086 0.0783 0.0993 0.0922
va: 1.9850 5.5199 2.1056 2.1096 2.1248 3.0524 3.0802 3.6354 3.9306 3.9333 3.9270 3.9533 3.8116 3.7343 4.1250 4.1130 3.9141 3.9471 3.8590 3.9056 1.0026 1.0185 1.0034 1.0029 1.0169 1.0029 1.0026 1.0132 1.0120 1.0165 1.0121 1.0098 1.0189 1.0059 1.0092 1.0071 1.0060 1.0097 1.0106 0.9916 1.0104 1.0094 1.0060
dispcorr: -0.020680631 hartree
energy: -1584.217674423363
dipole: -5.41460 6.99319 1.57859 -1.06648 1.03018 -0.03630 0.06931 -0.61000 -0.54069
magnitude: 1.66901 au
magnitude: 4.24230 debye
