program: Orca
programVersion: 5.0.2
elementType: S P O O O N N C C C C C C C C C C C C C H H H H H H H H H H H H H H H H H H H H H H H
charge: 0
multiplicity: 1
keywords: wb97x-d3
keywords: def2-TZVPP
keywords: def2/J RIJCOSX
keywords: DEFGRID2
keywords: scfconv7
keywords: smallprint printgap noloewdin
keywords: NOSOSCF
formula: C13H23N2O3PS
InChI: InChI=1/C13H23N2O3PS/c1-7-16-19(20,17-10(2)3)18-11-8-14-12(15-9-11)13(4,5)6/h8-10H,7H2,1-6H3
43 atoms
S  1.662007 -0.590095 2.25522
P  2.065118 -0.180003 0.430619
O  2.442068 1.336927 0.189501
O  0.858999 -0.486024 -0.629851
O  3.241491 -0.972426 -0.286164
N  -2.674733 -1.016055 -0.788004
N  -2.300234 0.94489 0.442056
C  -4.60509 0.204031 0.033735
C  -5.176478 -1.047505 0.708894
C  -5.212266 0.342494 -1.368137
C  -4.96514 1.433632 0.861917
C  -3.102623 0.043238 -0.102648
C  2.731037 1.907542 -1.12515
C  -0.465835 -0.275783 -0.399813
C  -1.374522 -1.179437 -0.930332
C  -0.990268 0.797125 0.296836
C  1.748386 3.032435 -1.354991
C  4.172998 2.359346 -1.124583
C  3.5918 -2.33118 0.051166
C  2.553238 -3.336003 -0.381789
H  -4.766728 -1.18594 1.711665
H  -4.965565 -1.948541 0.132692
H  -6.26053 -0.959692 0.805168
H  -4.827504 1.22282 -1.8874
H  -5.003507 -0.530668 -1.986856
H  -6.296679 0.448791 -1.298757
H  -4.569584 1.375948 1.876738
H  -6.051159 1.517742 0.93599
H  -4.594077 2.35564 0.413004
H  2.592313 1.145056 -1.896028
H  -1.029525 -2.044342 -1.489037
H  -0.360847 1.558274 0.745821
H  1.840781 3.804483 -0.589499
H  1.941332 3.494225 -2.323806
H  0.719499 2.670438 -1.362231
H  4.852164 1.524804 -0.948107
H  4.351769 3.12112 -0.36419
H  4.421445 2.788775 -2.09565
H  4.536331 -2.504032 -0.461684
H  3.776695 -2.394974 1.125252
H  2.939519 -4.33853 -0.192798
H  1.622688 -3.235964 0.177946
H  2.333848 -3.259079 -1.44677
elementType: S P O N C H
totalener: -1584.19587823 hartree
nucrepener: 2008.03287166 hartree
electener: -3592.22874988 hartree
oneelecener: -6164.88975037 hartree
twoeener: 2572.66100049 hartree
cpcmener: -0.02140026 hartree
kineticenergy: 1578.90056726 hartree
xcener: -118.036793398639 hartree
chargesum: -0.0000000
charge: -0.416511 0.703064 -0.346577 -0.328574 -0.325936 -0.391128 -0.344116 0.294990 -0.338287 -0.340107 -0.320652 0.241447 0.144896 0.257552 -0.018192 -0.001860 -0.255019 -0.253360 0.021815 -0.235107 0.103085 0.095956 0.095245 0.103583 0.095941 0.095973 0.093349 0.097289 0.092039 0.077373 0.137289 0.121738 0.093983 0.100484 0.097335 0.092608 0.090840 0.095203 0.107959 0.095682 0.100383 0.077487 0.090836
qa: -0.4165 0.7031 -0.3466 -0.3286 -0.3259 -0.3911 -0.3441 0.2950 -0.3383 -0.3401 -0.3207 0.2414 0.1449 0.2576 -0.0182 -0.0019 -0.2550 -0.2534 0.0218 -0.2351 0.1031 0.0960 0.0952 0.1036 0.0959 0.0960 0.0933 0.0973 0.0920 0.0774 0.1373 0.1217 0.0940 0.1005 0.0973 0.0926 0.0908 0.0952 0.1080 0.0957 0.1004 0.0775 0.0908
va: 2.0225 5.5116 2.1054 2.0619 2.1042 3.0548 3.0882 3.6304 3.9335 3.9339 3.9273 3.9582 3.8449 3.6757 4.1159 4.0747 3.9162 3.9339 3.8672 3.8849 1.0028 1.0183 1.0030 1.0024 1.0171 1.0031 1.0119 1.0028 1.0126 1.0092 1.0064 1.0254 1.0074 1.0078 1.0037 1.0129 1.0064 1.0057 0.9912 1.0083 1.0098 1.0181 1.0059
dispcorr: -0.021485847 hartree
energy: -1584.217364074190
dipole: -14.22559 15.55804 1.33245 4.47383 -4.62319 -0.14935 -10.27598 8.27934 -1.99663
magnitude: 2.40505 au
magnitude: 6.11316 debye
