program: Orca
programVersion: 5.0.2
elementType: S P O O O N N C C C C C C C C C C C C C H H H H H H H H H H H H H H H H H H H H H H H
charge: 0
multiplicity: 1
keywords: wb97x-d3
keywords: def2-TZVPP
keywords: def2/J RIJCOSX
keywords: DEFGRID2
keywords: scfconv7
keywords: smallprint printgap noloewdin
keywords: NOSOSCF
formula: C13H23N2O3PS
InChI: InChI=1/C13H23N2O3PS/c1-7-16-19(20,17-10(2)3)18-11-8-14-12(15-9-11)13(4,5)6/h8-10H,7H2,1-6H3
43 atoms
S  1.826924 -0.662039 2.316645
P  2.085695 -0.232264 0.471271
O  2.3396 1.306212 0.208362
O  0.845421 -0.625999 -0.516746
O  3.265782 -0.9499 -0.311468
N  -2.692621 -0.844382 -0.949572
N  -2.281916 0.845644 0.620097
C  -4.597301 0.345659 -0.026288
C  -5.279683 -0.956759 0.408136
C  -5.110553 0.746268 -1.414356
C  -4.935771 1.448742 0.972304
C  -3.100773 0.109067 -0.112944
C  2.502887 1.894673 -1.120597
C  -0.470695 -0.341668 -0.317976
C  -1.398775 -1.071724 -1.047857
C  -0.975123 0.633387 0.523894
C  1.444375 2.962036 -1.276472
C  3.912715 2.430229 -1.217262
C  3.741846 -2.274485 0.00521
C  2.791784 -3.35668 -0.441981
H  -6.360235 -0.811713 0.468785
H  -4.935473 -1.282151 1.392096
H  -5.093113 -1.76654 -0.297487
H  -6.188355 0.917922 -1.380882
H  -4.640796 1.667601 -1.76507
H  -4.920928 -0.030794 -2.155285
H  -4.491302 2.405563 0.696021
H  -4.601564 1.207563 1.982031
H  -6.018117 1.587239 1.008131
H  2.354269 1.126013 -1.883208
H  -1.071669 -1.852628 -1.727729
H  -0.338173 1.265981 1.13168
H  1.546087 3.738185 -0.516313
H  1.544611 3.434355 -2.25423
H  0.438812 2.544298 -1.214743
H  4.097973 3.201942 -0.468494
H  4.067494 2.873335 -2.2015
H  4.650778 1.637849 -1.091001
H  4.694877 -2.353043 -0.514815
H  3.937216 -2.338058 1.077332
H  2.55704 -3.274046 -1.503281
H  3.265092 -4.32592 -0.280061
H  1.860929 -3.349473 0.126089
elementType: S P O N C H
totalener: -1584.19576440 hartree
nucrepener: 2007.66264091 hartree
electener: -3591.85840531 hartree
oneelecener: -6164.06077572 hartree
twoeener: 2572.20237040 hartree
cpcmener: -0.02105905 hartree
kineticenergy: 1578.89806615 hartree
xcener: -118.037037168127 hartree
chargesum: 0.0000000
charge: -0.417785 0.700630 -0.344714 -0.318297 -0.326025 -0.390747 -0.344252 0.292431 -0.337404 -0.338904 -0.319907 0.240197 0.144755 0.260816 -0.019734 0.000132 -0.258711 -0.252992 0.020964 -0.233940 0.095164 0.102574 0.095691 0.095600 0.102996 0.095726 0.092148 0.093118 0.097547 0.078802 0.136400 0.111866 0.094601 0.100127 0.101007 0.091017 0.094940 0.092702 0.107692 0.095159 0.090232 0.098863 0.079514
qa: -0.4178 0.7006 -0.3447 -0.3183 -0.3260 -0.3907 -0.3443 0.2924 -0.3374 -0.3389 -0.3199 0.2402 0.1448 0.2608 -0.0197 0.0001 -0.2587 -0.2530 0.0210 -0.2339 0.0952 0.1026 0.0957 0.0956 0.1030 0.0957 0.0921 0.0931 0.0975 0.0788 0.1364 0.1119 0.0946 0.1001 0.1010 0.0910 0.0949 0.0927 0.1077 0.0952 0.0902 0.0989 0.0795
va: 2.0244 5.5200 2.1038 2.0821 2.1103 3.0545 3.0897 3.6321 3.9339 3.9341 3.9277 3.9566 3.8395 3.6748 4.1123 4.0539 3.9216 3.9316 3.8708 3.8872 1.0032 1.0028 1.0178 1.0033 1.0025 1.0172 1.0125 1.0121 1.0026 1.0085 1.0073 1.0348 1.0070 1.0074 1.0011 1.0064 1.0058 1.0131 0.9909 1.0087 1.0058 1.0097 1.0176
dispcorr: -0.021413242 hartree
energy: -1584.217177645497
dipole: -14.98255 16.23810 1.25555 5.77453 -5.86949 -0.09495 -11.29967 9.25098 -2.04869
magnitude: 2.40469 au
magnitude: 6.11224 debye
