program: Orca
programVersion: 5.0.2
elementType: S P O O O N N C C C C C C C C C C C C C H H H H H H H H H H H H H H H H H H H H H H H
charge: 0
multiplicity: 1
keywords: wb97x-d3
keywords: def2-TZVPP
keywords: def2/J RIJCOSX
keywords: DEFGRID2
keywords: scfconv7
keywords: smallprint printgap noloewdin
keywords: NOSOSCF
formula: C13H23N2O3PS
InChI: InChI=1/C13H23N2O3PS/c1-7-16-19(20,17-10(2)3)18-11-8-14-12(15-9-11)13(4,5)6/h8-10H,7H2,1-6H3
43 atoms
S  1.706192 0.030127 1.968049
P  1.83463 -0.133702 0.062207
O  3.021373 0.61695 -0.671083
O  0.575537 0.449133 -0.784275
O  1.908132 -1.597425 -0.552427
N  -2.96164 0.964907 -0.827092
N  -2.550301 -1.01609 0.353452
C  -4.856557 -0.24046 0.123492
C  -5.184429 0.642386 1.336529
C  -5.227539 -1.688147 0.439821
C  -5.667639 0.234543 -1.083548
C  -3.369898 -0.102074 -0.144518
C  3.668788 1.813822 -0.159467
C  -0.740065 0.215755 -0.522556
C  -1.66529 1.125403 -1.011482
C  -1.246678 -0.871416 0.168319
C  5.007665 1.896268 -0.85583
C  2.797222 3.026427 -0.403535
C  2.600301 -2.683406 0.093923
C  4.100513 -2.523958 0.056405
H  -4.628121 0.327863 2.2219
H  -6.248456 0.579649 1.574051
H  -4.947771 1.690695 1.145662
H  -6.303192 -1.762618 0.609548
H  -4.978169 -2.360166 -0.383503
H  -4.72562 -2.057118 1.333331
H  -6.733907 0.120387 -0.879724
H  -5.439833 -0.349735 -1.977382
H  -5.484767 1.283096 -1.314503
H  3.823601 1.679576 0.914602
H  -1.338186 1.997124 -1.570148
H  -0.612473 -1.648339 0.579776
H  5.562643 2.752945 -0.473608
H  5.607767 1.004084 -0.674139
H  4.891634 2.024832 -1.933326
H  3.322185 3.922426 -0.071442
H  1.860396 2.976677 0.15299
H  2.567019 3.144226 -1.463465
H  2.240966 -2.780841 1.12046
H  2.289395 -3.570498 -0.454987
H  4.5592 -3.43296 0.446539
H  4.464488 -2.376395 -0.960495
H  4.443469 -1.694354 0.67579
elementType: S P O N C H
totalener: -1584.19579349 hartree
nucrepener: 1989.92174256 hartree
electener: -3574.11753604 hartree
oneelecener: -6128.92317633 hartree
twoeener: 2554.80564029 hartree
cpcmener: -0.01911887 hartree
kineticenergy: 1578.91741015 hartree
xcener: -118.041689878860 hartree
chargesum: 0.0000000
charge: -0.431522 0.729045 -0.339716 -0.321320 -0.345523 -0.377359 -0.363688 0.269508 -0.339743 -0.314247 -0.320832 0.243581 0.138922 0.244809 -0.014738 0.008831 -0.245756 -0.242446 0.038337 -0.243253 0.103666 0.098268 0.099929 0.096741 0.098361 0.088839 0.095514 0.100539 0.090954 0.073829 0.136650 0.109978 0.091546 0.096707 0.090754 0.099441 0.086230 0.093151 0.093790 0.110220 0.099481 0.092978 0.079542
qa: -0.4315 0.7290 -0.3397 -0.3213 -0.3455 -0.3774 -0.3637 0.2695 -0.3397 -0.3142 -0.3208 0.2436 0.1389 0.2448 -0.0147 0.0088 -0.2458 -0.2424 0.0383 -0.2433 0.1037 0.0983 0.0999 0.0967 0.0984 0.0888 0.0955 0.1005 0.0910 0.0738 0.1367 0.1100 0.0915 0.0967 0.0908 0.0994 0.0862 0.0932 0.0938 0.1102 0.0995 0.0930 0.0795
va: 1.9908 5.5193 2.1313 2.1497 2.0983 3.0659 3.0903 3.6547 3.9334 3.9168 3.9174 3.9594 3.8325 3.7199 4.0998 4.0830 3.9325 3.8924 3.8498 3.9173 1.0054 1.0024 1.0096 1.0031 1.0089 1.0196 1.0036 1.0058 1.0228 1.0211 1.0079 1.0294 1.0059 1.0070 1.0067 1.0084 1.0197 1.0088 1.0088 0.9908 1.0095 1.0055 1.0134
dispcorr: -0.020683411 hartree
energy: -1584.216476895640
dipole: -7.02318 8.78380 1.76062 1.53953 -1.56751 -0.02799 -1.52615 0.99718 -0.52898
magnitude: 1.83858 au
magnitude: 4.67330 debye
