program: Gaussian 09
title: 000066595
version: EM64L-G09RevD.01
frameworkgroup: C1[X(C12H12O3)]
method: RPBEPBE
basis: SDD
operation: Freq
keyword: #pfreq=noraman
keyword: PBEPBE/SDD
title: #p freq=noraman PBEPBE/SDD
converged: NO YES NO NO
title: Mulliken charges:
elementType: O O O C C C C C C C C C C C C H H H H H H H H H H H H
charge: -0.254403 -0.254795 -0.204433 0.231270 0.206663 0.405982 -0.353858 0.362309 -0.508841 -0.402841 -0.485955 -0.810724 0.125440 -0.243021 -0.684145 0.245499 0.284191 0.255324 0.252654 0.240657 0.240168 0.240113 0.216870 0.216714 0.212517 0.233362 0.233282
chargesum: 0.00000
title: Mulliken charges with hydrogens summed into heavy atoms:
elementType: O O O C C C C C C C C C C C C
charge: -0.254403 -0.254795 -0.204433 0.231270 0.206663 0.405982 -0.108359 0.362309 -0.224650 -0.147517 -0.233301 -0.089786 0.125440 0.190563 -0.004984
polarizability: 2.32264245e+02 1.50345431e+01 1.56999048e+02 1.63814686e-02 3.65670449e-03 6.96878906e+01
1716.lowfreq: -7.3213 -2.8212 -0.0006 -0.0003 -0.0001 6.6884 47.5835 84.5428 108.3175
frequency: 47.5758 84.5425 108.3148 112.1103 126.7872 165.5483 200.9147 239.1811 240.2328 252.5404 272.4524 291.4823 332.2876 409.3145 434.8456 452.3324 490.4361 515.7849 545.8314 563.9290 628.7010 658.1932 670.5216 697.1636 744.3840 759.6683 783.2738 819.1896 822.9590 861.2692 871.7700 874.7972 956.4166 971.9955 995.9491 1030.6788 1045.1243 1053.3246 1112.0648 1118.7969 1135.0307 1136.2479 1173.3809 1232.6788 1251.7341 1263.0371 1278.5729 1363.8672 1383.4747 1386.0145 1399.9866 1401.9097 1436.4168 1461.7571 1465.9115 1469.9606 1476.2342 1486.6778 1505.6836 1547.9830 1606.8327 1620.6697 1690.8097 2965.5487 2982.3027 2999.2920 3026.2906 3059.2333 3096.8441 3102.6699 3108.3368 3150.5438 3171.4200 3178.1866 3185.0800
redmass: 3.7418 3.0991 3.9264 3.4288 2.6106 1.4414 1.9191 1.2312 3.8390 6.7780 3.8565 5.0120 4.2591 6.2202 5.4275 3.0120 5.9840 6.2206 4.0417 4.6280 3.9896 6.9110 3.6623 5.4524 3.2055 6.3618 5.9599 1.4108 1.2034 1.5583 1.3850 3.5323 1.3260 3.0092 1.8626 2.6222 1.5787 4.2774 2.3618 2.6545 1.4386 1.7400 2.1571 2.0687 1.8745 1.1407 1.6828 1.3735 4.5116 2.0810 1.4100 1.3294 5.4684 1.0397 1.0458 1.1088 1.0853 1.1291 2.9630 7.1175 7.3723 6.9401 10.4379 1.0555 1.0380 1.0363 1.1078 1.0969 1.0989 1.0985 1.1016 1.0881 1.0919 1.0963 1.0919
irintensity: 2.4109 2.9357 2.8882 0.4306 1.4431 0.0149 1.4399 0.2169 0.0355 0.5102 1.1593 6.4866 0.2465 0.2989 0.8790 5.7405 26.2801 7.4593 1.0073 1.4064 2.9688 0.6766 6.7436 0.8728 0.3954 5.4956 51.9692 4.6001 37.9154 31.5255 39.5796 14.9347 0.0024 68.8416 26.0664 52.1892 8.5442 94.9973 32.1605 14.2567 5.1062 57.8273 71.3766 45.5823 120.0493 0.0095 82.5986 57.6999 16.1176 92.5802 87.5978 7.0316 24.5873 12.5614 16.9069 9.0366 15.0861 20.0291 5.8756 15.6865 12.2773 526.6580 511.6264 27.0421 13.2403 24.5058 28.3755 13.1490 24.7397 21.1993 33.3922 5.8406 1.8574 5.5849 2.7830
temp: 298.150 k
press: 1.00000 atm
elementType: 8 8 8 6 6 6 6 6 6 6 6 6 6 6 6 1 1 1 1 1 1 1 1 1 1 1 1
symmnumber: 1
zpe: 553651.5 jmol-1
zpe.correction: 0.210875 hartree
zpe.thermalcorrener: 0.224593 hartree
zpe.thermalcorrenthalpy: 0.225537 hartree
zpe.thermalcorrgfe: 0.170490 hartree
zpe.sumelectzpe: -689.067155 hartree
zpe.sumelectthermal: -689.053437 hartree
zpe.sumelectthermalent: -689.052493 hartree
zpe.sumelectthermalfe: -689.107540 hartree
dipole: 3.1006 4.2693 0.0022
dipole: 5.2764
quadrupole: -78.6095 -92.7760 -89.6434
quadrupole: -23.3250 0.0089 -0.0019
quadrupole: 8.4001 -5.7664 -2.6337 -23.3250 0.0089 -0.0019
hfenergy: -689.2780299 hartree
pointgroup: C01 [X(C12H12O3)]
dipole: 1.2892271 1.6263367 0.0478583 debye
polarizability: 233.2406152|11.7697285|155.8574787|5.1749546|0.7254792|69.8530902 unknown
InChI: InChI=1S/C12H12O3/c1-3-14-9-4-5-10-8(2)6-12(13)15-11(10)7-9/h4-7H,3H2,1-2H3
charge 0 multiplicity 1
27 atoms
O  -1.190671 -1.583927 0.05693
O  3.266075 0.347008 0.201502
O  -3.284253 -2.555293 -0.01473
C  -0.942963 0.869413 0.074127
C  -0.384444 -0.443751 0.086588
C  -2.392907 1.010313 0.028783
C  -0.029152 1.966076 0.107109
C  1.876651 0.437201 0.159887
C  1.006131 -0.674616 0.128901
C  1.353011 1.764232 0.149054
C  -3.181742 -0.126921 -0.001076
C  -3.022375 2.386075 0.014513
C  -2.651139 -1.482802 0.00993
C  3.877541 -1.002826 0.217647
C  5.388769 -0.802822 0.263424
H  -0.417379 2.98935 0.099226
H  1.357847 -1.708468 0.135638
H  2.055617 2.601594 0.174077
H  -4.27246 -0.057825 -0.035223
H  -4.121549 2.319272 -0.019686
H  -2.686387 2.969284 -0.863395
H  -2.741458 2.963071 0.915614
H  3.513287 -1.554971 1.107378
H  3.567552 -1.551545 -0.694527
H  5.897798 -1.783538 0.272458
H  5.735115 -0.237502 -0.618323
H  5.682984 -0.247983 1.170375
