program: Orca
programVersion: 5.0.2
elementType: S P O O O N N C C C C C C C C C C C C C H H H H H H H H H H H H H H H H H H H H H H H
charge: 0
multiplicity: 1
keywords: wb97x-d3
keywords: def2-TZVPP
keywords: def2/J RIJCOSX
keywords: DEFGRID2
keywords: scfconv7
keywords: smallprint printgap noloewdin
keywords: NOSOSCF
formula: C13H23N2O3PS
InChI: InChI=1/C13H23N2O3PS/c1-7-16-19(20,17-10(2)3)18-11-8-14-12(15-9-11)13(4,5)6/h8-10H,7H2,1-6H3
43 atoms
S  1.917406 0.203032 1.745451
P  1.976011 0.123569 -0.17356
O  3.180831 0.772342 -0.962643
O  0.727191 0.865887 -0.922774
O  1.933055 -1.323364 -0.830115
N  -2.476473 0.727519 0.739346
N  -2.46532 -0.803496 -1.041559
C  -4.453931 -0.671027 0.339381
C  -5.34998 -0.497384 -0.891902
C  -5.039456 0.122161 1.504066
C  -4.395011 -2.156753 0.716922
C  -3.048897 -0.211825 -0.001323
C  3.883257 2.01426 -0.669507
C  -0.552603 0.501185 -0.604365
C  -1.235031 1.08526 0.444513
C  -1.228512 -0.454645 -1.343441
C  2.942496 3.159939 -0.363078
C  4.921982 1.783705 0.407039
C  1.998384 -2.558392 -0.086338
C  0.624085 -3.051143 0.288179
H  -5.412717 0.548797 -1.19864
H  -6.363358 -0.835833 -0.667385
H  -4.987379 -1.075328 -1.741864
H  -5.102005 1.188732 1.284707
H  -6.051112 -0.231484 1.712272
H  -4.455902 0.004932 2.417733
H  -5.394282 -2.522027 0.962144
H  -3.759313 -2.324025 1.588939
H  -4.010199 -2.766693 -0.101069
H  4.391123 2.223029 -1.611641
H  -0.776646 1.860401 1.048995
H  -0.761089 -0.934662 -2.197256
H  2.218583 3.317457 -1.162532
H  2.407381 3.018731 0.577082
H  3.529159 4.074485 -0.26966
H  5.561147 0.933979 0.165141
H  4.469393 1.611921 1.382997
H  5.559934 2.665045 0.481779
H  2.499657 -3.261739 -0.750024
H  2.624716 -2.428397 0.797466
H  0.720032 -4.008655 0.802461
H  0.116456 -2.360991 0.962844
H  -0.002176 -3.20849 -0.59027
elementType: S P O N C H
totalener: -1584.19128722 hartree
nucrepener: 2033.79245033 hartree
electener: -3617.98373755 hartree
oneelecener: -6216.80841198 hartree
twoeener: 2598.82467443 hartree
cpcmener: -0.01822583 hartree
kineticenergy: 1578.92185818 hartree
xcener: -118.044396745297 hartree
chargesum: -0.0000000
charge: -0.442199 0.754481 -0.344562 -0.353131 -0.353968 -0.343271 -0.381496 0.292345 -0.338107 -0.316273 -0.341323 0.247528 0.160290 0.249102 -0.004422 -0.041463 -0.272760 -0.273001 0.051005 -0.251633 0.102605 0.095327 0.095832 0.093363 0.097097 0.091290 0.096521 0.104238 0.096669 0.085620 0.135721 0.146495 0.103650 0.087595 0.103505 0.099925 0.088975 0.100012 0.108525 0.090447 0.109516 0.079231 0.090700
qa: -0.4422 0.7545 -0.3446 -0.3531 -0.3540 -0.3433 -0.3815 0.2923 -0.3381 -0.3163 -0.3413 0.2475 0.1603 0.2491 -0.0044 -0.0415 -0.2728 -0.2730 0.0510 -0.2516 0.1026 0.0953 0.0958 0.0934 0.0971 0.0913 0.0965 0.1042 0.0967 0.0856 0.1357 0.1465 0.1037 0.0876 0.1035 0.0999 0.0890 0.1000 0.1085 0.0904 0.1095 0.0792 0.0907
va: 1.9694 5.5060 2.1382 2.0803 2.1091 3.0820 3.0342 3.6337 3.9301 3.9272 3.9330 3.9619 3.8623 3.6891 4.1118 4.1164 3.8846 3.9277 3.8343 3.9073 1.0029 1.0032 1.0190 1.0119 1.0027 1.0133 1.0035 1.0027 1.0161 0.9913 1.0121 1.0078 1.0112 1.0210 1.0080 1.0076 1.0168 1.0073 0.9942 1.0156 1.0094 1.0131 1.0025
dispcorr: -0.022324264 hartree
energy: -1584.213611481772
dipole: -14.10122 15.22420 1.12299 -4.24881 4.20441 -0.04439 3.47492 -4.11326 -0.63833
magnitude: 1.29250 au
magnitude: 3.28526 debye
