program: Orca
programVersion: 5.0.2
elementType: S P O O O N N C C C C C C C C C C C C C H H H H H H H H H H H H H H H H H H H H H H H
charge: 0
multiplicity: 1
keywords: wb97x-d3
keywords: def2-TZVPP
keywords: def2/J RIJCOSX
keywords: DEFGRID2
keywords: scfconv7
keywords: smallprint printgap noloewdin
keywords: NOSOSCF
formula: C13H23N2O3PS
InChI: InChI=1/C13H23N2O3PS/c1-7-16-19(20,17-10(2)3)18-11-8-14-12(15-9-11)13(4,5)6/h8-10H,7H2,1-6H3
43 atoms
S  1.808692 -0.365929 2.000784
P  1.865883 -0.379241 0.083877
O  1.992713 1.012109 -0.667268
O  0.547834 -0.978959 -0.653576
O  2.983067 -1.258222 -0.617042
N  -2.418998 0.872946 0.336967
N  -3.026054 -1.10087 -0.768999
C  -4.781659 0.424252 0.032577
C  -5.720877 -0.569375 -0.643829
C  -5.000603 1.817039 -0.569026
C  -5.089399 0.469268 1.534085
C  -3.326395 0.033158 -0.150311
C  2.75415 2.139496 -0.146582
C  -0.739666 -0.589623 -0.436373
C  -1.138894 0.578269 0.198828
C  -1.747028 -1.412602 -0.907145
C  4.237446 1.881157 -0.291458
C  2.287389 3.354079 -0.914913
C  3.432849 -2.533279 -0.101329
C  4.912485 -2.470461 0.170478
H  -5.620733 -1.575974 -0.236864
H  -5.55197 -0.627389 -1.71997
H  -6.75479 -0.253893 -0.490801
H  -4.782604 1.831125 -1.638966
H  -6.041365 2.121077 -0.440891
H  -4.3735 2.567922 -0.088481
H  -6.127885 0.766055 1.694733
H  -4.454813 1.186345 2.055573
H  -4.949442 -0.50708 2.002878
H  2.49814 2.25496 0.910127
H  -0.434356 1.295351 0.603324
H  -1.506376 -2.342714 -1.4126
H  4.791654 2.759732 0.040722
H  4.571108 1.04122 0.319403
H  4.507845 1.685573 -1.330114
H  2.523845 3.274235 -1.977133
H  2.788641 4.24052 -0.525489
H  1.213179 3.507822 -0.807299
H  2.882667 -2.793139 0.805086
H  3.19622 -3.276641 -0.862406
H  5.260264 -3.453617 0.489863
H  5.47352 -2.192789 -0.722479
H  5.143847 -1.76037 0.964918
elementType: S P O N C H
totalener: -1584.19569215 hartree
nucrepener: 1985.56337207 hartree
electener: -3569.75906422 hartree
oneelecener: -6120.15751628 hartree
twoeener: 2550.39845206 hartree
cpcmener: -0.01910064 hartree
kineticenergy: 1578.90304374 hartree
xcener: -118.037900125168 hartree
chargesum: -0.0000000
charge: -0.434310 0.724141 -0.338195 -0.317417 -0.339722 -0.392515 -0.345666 0.291988 -0.320150 -0.338191 -0.338089 0.237999 0.139828 0.246553 0.009752 -0.015963 -0.241348 -0.246886 0.047419 -0.240432 0.092147 0.093606 0.097361 0.102301 0.095394 0.096251 0.095734 0.096427 0.103060 0.077230 0.104288 0.135236 0.099513 0.083371 0.095202 0.091002 0.091307 0.098072 0.085546 0.106374 0.096963 0.092061 0.082758
qa: -0.4343 0.7241 -0.3382 -0.3174 -0.3397 -0.3925 -0.3457 0.2920 -0.3201 -0.3382 -0.3381 0.2380 0.1398 0.2466 0.0098 -0.0160 -0.2413 -0.2469 0.0474 -0.2404 0.0921 0.0936 0.0974 0.1023 0.0954 0.0963 0.0957 0.0964 0.1031 0.0772 0.1043 0.1352 0.0995 0.0834 0.0952 0.0910 0.0913 0.0981 0.0855 0.1064 0.0970 0.0921 0.0828
va: 1.9864 5.5293 2.1065 2.1674 2.1219 3.0717 3.0798 3.6323 3.9264 3.9294 3.9328 3.9649 3.8211 3.7152 4.0750 4.0892 3.9095 3.9294 3.8357 3.9294 1.0131 1.0114 1.0029 1.0031 1.0031 1.0190 1.0027 1.0163 1.0028 1.0203 1.0319 1.0090 1.0092 1.0161 1.0085 1.0063 1.0059 1.0064 1.0156 0.9971 1.0097 1.0030 1.0078
dispcorr: -0.020421296 hartree
energy: -1584.216113443197
dipole: -7.25064 8.91277 1.66213 9.40765 -9.31462 0.09303 -2.42199 1.79765 -0.62434
magnitude: 1.77796 au
magnitude: 4.51921 debye
