program: Orca
programVersion: 5.0.2
elementType: S P O O O N N C C C C C C C C C C C C C H H H H H H H H H H H H H H H H H H H H H H H
charge: 0
multiplicity: 1
keywords: wb97x-d3
keywords: def2-TZVPP
keywords: def2/J RIJCOSX
keywords: DEFGRID2
keywords: scfconv7
keywords: smallprint printgap noloewdin
keywords: NOSOSCF
formula: C13H23N2O3PS
InChI: InChI=1/C13H23N2O3PS/c1-7-16-19(20,17-10(2)3)18-11-8-14-12(15-9-11)13(4,5)6/h8-10H,7H2,1-6H3
43 atoms
S  3.52014 -0.386631 1.640017
P  2.057552 0.052265 0.48613
O  2.051585 1.486079 -0.193699
O  0.656951 0.108516 1.302564
O  1.774726 -0.917399 -0.747417
N  -2.846239 -0.596589 1.186342
N  -2.268176 0.432781 -0.837507
C  -4.589142 -0.248509 -0.482545
C  -4.751889 -1.66419 -1.054158
C  -4.914097 0.774305 -1.570024
C  -5.554353 -0.058688 0.688734
C  -3.152123 -0.112776 -0.014436
C  3.246165 2.135156 -0.710981
C  -0.605218 0.04106 0.7871
C  -1.589387 -0.525644 1.581535
C  -1.004385 0.519448 -0.448848
C  3.754022 1.425555 -1.947607
C  2.855895 3.57059 -0.975547
C  2.044649 -2.335195 -0.701009
C  1.080439 -3.088064 0.181816
H  -4.080978 -1.832796 -1.898739
H  -5.774117 -1.815075 -1.407555
H  -4.543834 -2.427562 -0.302332
H  -4.771161 1.797975 -1.218991
H  -4.302577 0.639207 -2.461358
H  -5.959456 0.671942 -1.867716
H  -6.584176 -0.13265 0.33404
H  -5.437083 0.922992 1.152403
H  -5.416686 -0.81223 1.462957
H  4.006625 2.10049 0.074287
H  -1.343527 -0.922857 2.561516
H  -0.317922 0.989756 -1.14299
H  4.599125 1.980369 -2.356678
H  4.108698 0.417195 -1.730702
H  2.98505 1.367608 -2.719397
H  2.484251 4.056442 -0.073195
H  2.090263 3.639614 -1.750262
H  3.729116 4.127246 -1.315855
H  1.960745 -2.663647 -1.735496
H  3.076519 -2.491026 -0.380409
H  0.045221 -2.92513 -0.118615
H  1.287074 -4.15566 0.092915
H  1.189297 -2.824423 1.234586
elementType: S P O N C H
totalener: -1584.19441766 hartree
nucrepener: 2012.08110061 hartree
electener: -3596.27551827 hartree
oneelecener: -6172.85699345 hartree
twoeener: 2576.58147518 hartree
cpcmener: -0.01904543 hartree
kineticenergy: 1578.90673866 hartree
xcener: -118.038947820082 hartree
chargesum: -0.0000000
charge: -0.418708 0.687531 -0.323045 -0.321482 -0.327951 -0.374506 -0.365621 0.269473 -0.341009 -0.313113 -0.319864 0.245365 0.121003 0.194850 -0.003937 0.026587 -0.242802 -0.249874 0.033595 -0.242344 0.103094 0.098359 0.100542 0.099387 0.087414 0.097038 0.095214 0.100642 0.090940 0.080111 0.137084 0.120379 0.099994 0.086416 0.095223 0.098688 0.091050 0.091059 0.111192 0.098365 0.088864 0.108540 0.086255
qa: -0.4187 0.6875 -0.3230 -0.3215 -0.3280 -0.3745 -0.3656 0.2695 -0.3410 -0.3131 -0.3199 0.2454 0.1210 0.1948 -0.0039 0.0266 -0.2428 -0.2499 0.0336 -0.2423 0.1031 0.0984 0.1005 0.0994 0.0874 0.0970 0.0952 0.1006 0.0909 0.0801 0.1371 0.1204 0.1000 0.0864 0.0952 0.0987 0.0911 0.0911 0.1112 0.0984 0.0889 0.1085 0.0863
va: 2.0404 5.5244 2.1158 2.1296 2.0496 3.0613 3.0865 3.6536 3.9331 3.9167 3.9177 3.9569 3.8480 3.7692 4.0850 4.0472 3.8817 3.9338 3.8341 3.8997 1.0058 1.0027 1.0090 1.0086 1.0203 1.0031 1.0036 1.0062 1.0222 1.0201 1.0100 1.0350 1.0088 1.0198 1.0068 1.0086 1.0049 1.0057 0.9915 1.0117 1.0051 1.0102 1.0160
dispcorr: -0.021648096 hartree
energy: -1584.216065753197
dipole: -17.90541 18.36375 0.45834 -0.47425 0.27804 -0.19621 -15.50711 14.11458 -1.39253
magnitude: 1.47909 au
magnitude: 3.75956 debye
