program: Orca
programVersion: 5.0.2
elementType: S P O O O N N C C C C C C C C C C C C C H H H H H H H H H H H H H H H H H H H H H H H
charge: 0
multiplicity: 1
keywords: wb97x-d3
keywords: def2-TZVPP
keywords: def2/J RIJCOSX
keywords: DEFGRID2
keywords: scfconv7
keywords: smallprint printgap noloewdin
keywords: NOSOSCF
formula: C13H23N2O3PS
InChI: InChI=1/C13H23N2O3PS/c1-7-16-19(20,17-10(2)3)18-11-8-14-12(15-9-11)13(4,5)6/h8-10H,7H2,1-6H3
43 atoms
S  1.819879 -0.778379 1.883711
P  1.939966 -0.430372 0.005986
O  1.914375 1.08695 -0.463984
O  0.733028 -1.028652 -0.904263
O  3.197487 -1.018998 -0.768802
N  -2.375107 0.80419 -1.036007
N  -2.606787 -0.994065 0.460611
C  -4.517749 0.455269 0.10047
C  -4.883795 1.777335 -0.568618
C  -4.721046 0.57354 1.615326
C  -5.415028 -0.663388 -0.446811
C  -3.075629 0.076976 -0.176948
C  2.384799 2.176419 0.358741
C  -0.553861 -0.643197 -0.643778
C  -1.121986 0.448189 -1.271323
C  -1.357192 -1.34926 0.238133
C  3.898511 2.166798 0.433252
C  1.83102 3.442141 -0.259129
C  3.838862 -2.238406 -0.374064
C  3.023909 -3.462015 -0.725612
H  -4.260356 2.597189 -0.211445
H  -5.92301 2.024803 -0.344744
H  -4.773232 1.731926 -1.651164
H  -4.099125 1.364307 2.038796
H  -5.761634 0.818825 1.834616
H  -4.475832 -0.35716 2.12446
H  -6.46407 -0.433268 -0.252178
H  -5.185398 -1.619735 0.022467
H  -5.295375 -0.776129 -1.525918
H  1.970169 2.043685 1.36257
H  -0.555609 1.043445 -1.979998
H  -0.975311 -2.216495 0.766607
H  4.27031 1.270379 0.929594
H  4.342272 2.223166 -0.561115
H  4.245427 3.024708 1.009274
H  2.109437 4.301704 0.350161
H  0.743169 3.412049 -0.317015
H  2.226729 3.599355 -1.263267
H  4.789007 -2.237113 -0.906572
H  4.049444 -2.207371 0.69759
H  3.60268 -4.358544 -0.503417
H  2.104081 -3.512717 -0.143701
H  2.766357 -3.478909 -1.783726
totalener: -1584.17845751 hartree
nucrepener: 2017.08986539 hartree
electener: -3601.26832290 hartree
oneelecener: -6182.84240438 hartree
twoeener: 2581.57408148 hartree
kineticenergy: 1578.98036519 hartree
xcener: -118.049156847280 hartree
chargesum: -0.0000000
charge: -0.384192 0.697887 -0.329683 -0.336629 -0.312794 -0.300102 -0.337753 0.252717 -0.276837 -0.310473 -0.319514 0.218346 0.116490 0.226407 -0.030579 -0.010504 -0.224923 -0.238075 0.020042 -0.224746 0.088075 0.083914 0.090027 0.090357 0.081862 0.104682 0.083987 0.103504 0.093801 0.073962 0.124013 0.115764 0.085946 0.089938 0.084432 0.082485 0.097148 0.085808 0.097490 0.090490 0.085537 0.080067 0.091624
qa: -0.3842 0.6979 -0.3297 -0.3366 -0.3128 -0.3001 -0.3378 0.2527 -0.2768 -0.3105 -0.3195 0.2183 0.1165 0.2264 -0.0306 -0.0105 -0.2249 -0.2381 0.0200 -0.2247 0.0881 0.0839 0.0900 0.0904 0.0819 0.1047 0.0840 0.1035 0.0938 0.0740 0.1240 0.1158 0.0859 0.0899 0.0844 0.0825 0.0971 0.0858 0.0975 0.0905 0.0855 0.0801 0.0916
va: 2.0431 5.5483 2.1404 2.1135 2.1253 3.0794 3.0753 3.7189 3.9317 3.9362 3.9368 3.9670 3.8827 3.7146 4.1228 4.1470 3.8847 3.9313 3.8844 3.9008 1.0149 1.0042 1.0176 1.0068 1.0053 1.0197 1.0056 1.0155 1.0059 1.0230 1.0126 1.0146 1.0256 1.0101 1.0112 1.0095 1.0087 1.0082 0.9911 1.0141 1.0115 1.0184 1.0072
dispcorr: -0.021064761 hartree
energy: -1584.199522267556
dipole: -11.84473 12.95621 1.11148 9.10447 -8.94974 0.15473 -0.21154 -0.18241 -0.39395
magnitude: 1.18934 au
magnitude: 3.02306 debye
