program: Orca
programVersion: 5.0.2
elementType: S P O O O N N C C C C C C C C C C C C C H H H H H H H H H H H H H H H H H H H H H H H
charge: 0
multiplicity: 1
keywords: wb97x-d3
keywords: def2-TZVPP
keywords: def2/J RIJCOSX
keywords: DEFGRID2
keywords: scfconv7
keywords: smallprint printgap noloewdin
keywords: NOSOSCF
formula: C13H23N2O3PS
InChI: InChI=1/C13H23N2O3PS/c1-7-16-19(20,17-10(2)3)18-11-8-14-12(15-9-11)13(4,5)6/h8-10H,7H2,1-6H3
43 atoms
S  1.91004 -0.523859 1.921022
P  1.946693 -0.443332 0.007783
O  1.850476 0.99392 -0.665938
O  0.728927 -1.202592 -0.75986
O  3.189946 -1.108655 -0.726193
N  -2.3964 0.539964 -1.234619
N  -2.552649 -0.797159 0.693084
C  -4.479699 0.52888 0.0593
C  -5.390567 -0.703281 0.112543
C  -4.959164 1.472106 -1.040341
C  -4.526124 1.25175 1.411772
C  -3.055714 0.066957 -0.186297
C  2.197459 2.217989 0.018301
C  -0.551403 -0.763819 -0.551564
C  -1.150337 0.13084 -1.416734
C  -1.312664 -1.209292 0.518288
C  3.703165 2.355479 0.115948
C  1.547735 3.340226 -0.762153
C  3.951956 -2.17123 -0.13799
C  3.216704 -3.491619 -0.154743
H  -5.078062 -1.394537 0.893868
H  -5.38626 -1.240671 -0.83749
H  -6.419283 -0.401499 0.316917
H  -4.949757 0.99311 -2.019078
H  -5.982891 1.786574 -0.830285
H  -4.340104 2.365648 -1.109147
H  -5.544589 1.581245 1.625534
H  -3.886058 2.135959 1.413281
H  -4.203797 0.598808 2.221973
H  1.770624 2.175342 1.024744
H  -0.614149 0.518989 -2.276445
H  -0.905159 -1.910696 1.238592
H  3.959101 3.306413 0.583426
H  4.136243 1.564765 0.728855
H  4.166957 2.326628 -0.870534
H  1.737497 4.290814 -0.263899
H  0.467885 3.206133 -0.825452
H  1.949002 3.40521 -1.774251
H  4.861223 -2.223053 -0.735449
H  4.230883 -1.897215 0.882277
H  3.883552 -4.280371 0.19418
H  2.351275 -3.476178 0.507406
H  2.883298 -3.750184 -1.158831
totalener: -1584.17801374 hartree
nucrepener: 2020.23860459 hartree
electener: -3604.41661833 hartree
oneelecener: -6189.13041973 hartree
twoeener: 2584.71380140 hartree
kineticenergy: 1578.96938698 hartree
xcener: -118.047498759255 hartree
chargesum: 0.0000000
charge: -0.388826 0.701123 -0.330197 -0.334102 -0.313402 -0.297418 -0.339082 0.255576 -0.315787 -0.276831 -0.317730 0.218395 0.118619 0.228653 -0.040348 -0.010894 -0.225984 -0.235889 0.023449 -0.227492 0.103900 0.091101 0.083025 0.089532 0.084061 0.088365 0.083563 0.091370 0.105450 0.073196 0.124947 0.118509 0.084095 0.086566 0.089645 0.082706 0.097038 0.085402 0.097331 0.089376 0.085044 0.082716 0.091226
qa: -0.3888 0.7011 -0.3302 -0.3341 -0.3134 -0.2974 -0.3391 0.2556 -0.3158 -0.2768 -0.3177 0.2184 0.1186 0.2287 -0.0403 -0.0109 -0.2260 -0.2359 0.0234 -0.2275 0.1039 0.0911 0.0830 0.0895 0.0841 0.0884 0.0836 0.0914 0.1054 0.0732 0.1249 0.1185 0.0841 0.0866 0.0896 0.0827 0.0970 0.0854 0.0973 0.0894 0.0850 0.0827 0.0912
va: 2.0332 5.5367 2.1365 2.1162 2.1274 3.0726 3.0742 3.7156 3.9367 3.9327 3.9385 3.9654 3.8788 3.7145 4.1123 4.1435 3.8890 3.9318 3.8838 3.8977 1.0188 1.0062 1.0053 1.0154 1.0040 1.0168 1.0052 1.0062 1.0165 1.0235 1.0122 1.0158 1.0113 1.0257 1.0099 1.0093 1.0090 1.0085 0.9914 1.0135 1.0112 1.0199 1.0072
dispcorr: -0.021055016 hartree
energy: -1584.199068759670
dipole: -12.21471 13.28529 1.07058 10.06594 -9.90115 0.16479 -0.74647 0.37847 -0.36800
magnitude: 1.14399 au
magnitude: 2.90779 debye
