program: Orca
programVersion: 5.0.2
elementType: S P O O O N N C C C C C C C C C C C C C H H H H H H H H H H H H H H H H H H H H H H H
charge: 0
multiplicity: 1
keywords: wb97x-d3
keywords: def2-TZVPP
keywords: def2/J RIJCOSX
keywords: DEFGRID2
keywords: scfconv7
keywords: smallprint printgap noloewdin
keywords: NOSOSCF
formula: C13H23N2O3PS
InChI: InChI=1/C13H23N2O3PS/c1-7-16-19(20,17-10(2)3)18-11-8-14-12(15-9-11)13(4,5)6/h8-10H,7H2,1-6H3
43 atoms
S  1.837755 -0.27111 1.948824
P  1.9290 -0.282942 0.036589
O  1.94469 1.126591 -0.700912
O  0.694225 -1.002707 -0.734701
O  3.146656 -1.058637 -0.633342
N  -2.613004 -0.845845 0.699861
N  -2.501302 0.627461 -1.129145
C  -4.621734 0.35973 0.072202
C  -5.098551 1.442487 -0.892091
C  -4.833318 0.828709 1.516128
C  -5.424456 -0.926602 -0.163794
C  -3.152765 0.039784 -0.135606
C  2.55975 2.30076 -0.125104
C  -0.597401 -0.616941 -0.50101
C  -1.347462 -1.170207 0.525605
C  -1.229934 0.304563 -1.311876
C  4.069651 2.162562 -0.105613
C  2.087651 3.473943 -0.956557
C  3.801597 -2.159468 0.011097
C  2.957839 -3.413624 0.028769
H  -4.545801 2.372762 -0.762186
H  -6.154538 1.651461 -0.712635
H  -4.987248 1.140049 -1.932635
H  -4.28032 1.746918 1.721722
H  -5.890882 1.034747 1.689893
H  -4.512065 0.073522 2.231721
H  -6.487594 -0.741352 -0.000545
H  -5.110275 -1.719249 0.514564
H  -5.304759 -1.286745 -1.187237
H  2.19177 2.403018 0.900473
H  -0.909184 -1.890318 1.208422
H  -0.701139 0.782462 -2.130164
H  4.461248 1.963443 -1.10356
H  4.517921 3.08766 0.257287
H  4.393547 1.363451 0.561742
H  2.471873 4.402015 -0.533799
H  0.999998 3.53786 -0.969918
H  2.443042 3.399456 -1.984912
H  4.714649 -2.312078 -0.562863
H  4.082582 -1.870532 1.026763
H  2.088039 -3.301324 0.675778
H  2.617654 -3.681492 -0.970733
H  3.551005 -4.241609 0.418359
totalener: -1584.17832843 hartree
nucrepener: 2009.16315877 hartree
electener: -3593.34148720 hartree
oneelecener: -6166.99560152 hartree
twoeener: 2573.65411432 hartree
kineticenergy: 1578.95857691 hartree
xcener: -118.045328442474 hartree
chargesum: -0.0000000
charge: -0.385242 0.696127 -0.326933 -0.336060 -0.314695 -0.339588 -0.298755 0.251796 -0.275430 -0.312255 -0.318798 0.220392 0.113921 0.222807 -0.006511 -0.023461 -0.227245 -0.234603 0.023882 -0.226321 0.088239 0.083845 0.089507 0.090765 0.082205 0.104391 0.083454 0.103431 0.093239 0.074508 0.113922 0.121718 0.092332 0.084342 0.084698 0.080035 0.095825 0.085254 0.097627 0.089722 0.079713 0.092193 0.086009
qa: -0.3852 0.6961 -0.3269 -0.3361 -0.3147 -0.3396 -0.2988 0.2518 -0.2754 -0.3123 -0.3188 0.2204 0.1139 0.2228 -0.0065 -0.0235 -0.2272 -0.2346 0.0239 -0.2263 0.0882 0.0838 0.0895 0.0908 0.0822 0.1044 0.0835 0.1034 0.0932 0.0745 0.1139 0.1217 0.0923 0.0843 0.0847 0.0800 0.0958 0.0853 0.0976 0.0897 0.0797 0.0922 0.0860
va: 2.0396 5.5466 2.1483 2.1178 2.1180 3.0769 3.0879 3.7223 3.9315 3.9374 3.9367 3.9616 3.8876 3.7140 4.1438 4.1335 3.8780 3.9335 3.8796 3.9017 1.0155 1.0041 1.0168 1.0067 1.0051 1.0187 1.0057 1.0166 1.0060 1.0222 1.0151 1.0126 1.0102 1.0113 1.0250 1.0090 1.0095 1.0083 0.9914 1.0127 1.0188 1.0071 1.0117
dispcorr: -0.020862678 hartree
energy: -1584.199191109409
dipole: -11.37089 12.54975 1.17886 7.40733 -7.33396 0.07337 -1.55845 1.13991 -0.41854
magnitude: 1.25311 au
magnitude: 3.18514 debye
