program: Orca
programVersion: 5.0.2
elementType: S P O O O N N C C C C C C C C C C C C C H H H H H H H H H H H H H H H H H H H H H H H
charge: 0
multiplicity: 1
keywords: wb97x-d3
keywords: def2-TZVPP
keywords: def2/J RIJCOSX
keywords: DEFGRID2
keywords: scfconv7
keywords: smallprint printgap noloewdin
keywords: NOSOSCF
formula: C13H23N2O3PS
InChI: InChI=1/C13H23N2O3PS/c1-7-16-19(20,17-10(2)3)18-11-8-14-12(15-9-11)13(4,5)6/h8-10H,7H2,1-6H3
43 atoms
S  1.611696 -0.585706 1.78882
P  1.828228 -0.254277 -0.082128
O  2.144593 1.236671 -0.533852
O  0.538396 -0.583163 -1.012155
O  2.934293 -1.087749 -0.863355
N  -3.00624 -1.019412 -0.790756
N  -2.463518 0.997862 0.278592
C  -4.811678 0.305154 0.141192
C  -5.530108 0.426782 -1.209029
C  -5.047165 1.569541 0.961959
C  -5.360496 -0.909014 0.899225
C  -3.335243 0.089196 -0.130069
C  2.935228 2.140484 0.272085
C  -0.752583 -0.322661 -0.666951
C  -1.732189 -1.225582 -1.050797
C  -1.181567 0.802017 0.01468
C  4.390171 1.715478 0.293724
C  2.736238 3.518266 -0.322304
C  3.178686 -2.471305 -0.564631
C  4.433633 -2.620666 0.261885
H  -5.387998 -0.467569 -1.814845
H  -5.163853 1.283741 -1.777341
H  -6.601641 0.565938 -1.054493
H  -6.116553 1.695843 1.139621
H  -4.548837 1.522772 1.930041
H  -4.68273 2.459982 0.451001
H  -6.42981 -0.785633 1.079806
H  -4.872898 -1.026013 1.868607
H  -5.21552 -1.828983 0.334664
H  2.536731 2.117212 1.29127
H  -1.465704 -2.129882 -1.589343
H  -0.490544 1.566643 0.351967
H  4.795526 1.643999 -0.715566
H  4.976838 2.450822 0.844676
H  4.524638 0.755644 0.791804
H  1.682786 3.795675 -0.341166
H  3.124091 3.570366 -1.339898
H  3.265411 4.257086 0.278935
H  2.325623 -2.912392 -0.043303
H  3.274615 -2.971436 -1.528265
H  4.646056 -3.678188 0.420861
H  5.29367 -2.177022 -0.239251
H  4.313539 -2.151478 1.23786
totalener: -1584.17676510 hartree
nucrepener: 1992.38633437 hartree
electener: -3576.56309948 hartree
oneelecener: -6133.35104404 hartree
twoeener: 2556.78794456 hartree
kineticenergy: 1578.96987101 hartree
xcener: -118.048830713581 hartree
chargesum: -0.0000000
charge: -0.373209 0.674593 -0.318114 -0.317207 -0.314574 -0.340228 -0.300756 0.252252 -0.319309 -0.276239 -0.314001 0.219426 0.103504 0.234260 -0.029840 0.013407 -0.222897 -0.223663 0.034361 -0.240838 0.102502 0.093104 0.083206 0.083433 0.090527 0.088449 0.082114 0.092906 0.101842 0.076762 0.114290 0.089388 0.093048 0.085767 0.082075 0.092687 0.086524 0.078826 0.082755 0.096128 0.088827 0.087986 0.085926
qa: -0.3732 0.6746 -0.3181 -0.3172 -0.3146 -0.3402 -0.3008 0.2523 -0.3193 -0.2762 -0.3140 0.2194 0.1035 0.2343 -0.0298 0.0134 -0.2229 -0.2237 0.0344 -0.2408 0.1025 0.0931 0.0832 0.0834 0.0905 0.0884 0.0821 0.0929 0.1018 0.0768 0.1143 0.0894 0.0930 0.0858 0.0821 0.0927 0.0865 0.0788 0.0828 0.0961 0.0888 0.0880 0.0859
va: 2.0432 5.5581 2.1219 2.1510 2.1209 3.0702 3.1062 3.7210 3.9377 3.9310 3.9367 3.9613 3.8731 3.7121 4.1308 4.0884 3.9014 3.9318 3.8824 3.9136 1.0167 1.0059 1.0057 1.0039 1.0152 1.0169 1.0053 1.0062 1.0190 1.0201 1.0101 1.0279 1.0100 1.0119 1.0216 1.0094 1.0084 1.0082 1.0111 0.9952 1.0140 1.0022 1.0184
dispcorr: -0.020671506 hartree
energy: -1584.197436609981
dipole: -7.08555 8.42182 1.33627 6.67960 -6.65390 0.02570 1.62756 -2.04004 -0.41248
magnitude: 1.39872 au
magnitude: 3.55527 debye
