program: Orca
programVersion: 5.0.2
elementType: S P O O O N N C C C C C C C C C C C C C H H H H H H H H H H H H H H H H H H H H H H H
charge: 0
multiplicity: 1
keywords: wb97x-d3
keywords: def2-TZVPP
keywords: def2/J RIJCOSX
keywords: DEFGRID2
keywords: scfconv7
keywords: smallprint printgap noloewdin
keywords: NOSOSCF
formula: C13H23N2O3PS
InChI: InChI=1/C13H23N2O3PS/c1-7-16-19(20,17-10(2)3)18-11-8-14-12(15-9-11)13(4,5)6/h8-10H,7H2,1-6H3
43 atoms
S  1.714631 0.123287 1.83036
P  1.936154 -0.039814 -0.062304
O  3.103625 0.802491 -0.735479
O  0.672304 0.408518 -0.975937
O  2.184991 -1.498372 -0.653178
N  -2.381462 -1.222371 0.113787
N  -2.843311 0.978683 -0.558541
C  -4.691141 -0.408803 0.190942
C  -5.438595 -0.344361 -1.147432
C  -5.187109 0.718725 1.102974
C  -4.954192 -1.756695 0.856717
C  -3.213438 -0.212053 -0.090962
C  3.57737 2.05639 -0.194016
C  -0.627268 0.163594 -0.641839
C  -1.099177 -1.044209 -0.159792
C  -1.566634 1.166942 -0.824356
C  4.894698 2.344003 -0.881479
C  2.554835 3.156707 -0.40278
C  3.103578 -2.401352 -0.019401
C  2.350231 -3.485638 0.713567
H  -6.509901 -0.477317 -0.986856
H  -5.106015 -1.13117 -1.82677
H  -5.286947 0.615935 -1.640067
H  -5.024528 1.69663 0.652253
H  -6.256164 0.604133 1.290839
H  -4.678057 0.702002 2.068265
H  -4.634365 -2.589219 0.231541
H  -6.023179 -1.867607 1.04699
H  -4.432497 -1.845222 1.809632
H  3.743738 1.917881 0.878719
H  -0.440684 -1.890384 0.003497
H  -1.268372 2.139514 -1.204273
H  5.330833 3.255197 -0.472375
H  5.607893 1.534568 -0.728915
H  4.759631 2.48724 -1.954084
H  2.298128 3.262145 -1.457288
H  2.963392 4.106592 -0.057275
H  1.642384 2.971955 0.164322
H  3.720701 -2.813229 -0.818165
H  3.763978 -1.866106 0.668074
H  3.05367 -4.199193 1.142905
H  1.759312 -3.064743 1.526559
H  1.688011 -4.031181 0.041572
totalener: -1584.17688036 hartree
nucrepener: 1997.83813009 hartree
electener: -3582.01501045 hartree
oneelecener: -6144.27480036 hartree
twoeener: 2562.25978990 hartree
kineticenergy: 1578.95610009 hartree
xcener: -118.045829550074 hartree
chargesum: -0.0000000
charge: -0.374518 0.682135 -0.317840 -0.316501 -0.321233 -0.303267 -0.339867 0.246529 -0.320706 -0.310811 -0.277115 0.223093 0.117168 0.227441 0.013964 -0.020556 -0.226775 -0.233559 0.028411 -0.248084 0.084113 0.094173 0.102066 0.101952 0.081906 0.092159 0.089218 0.083359 0.090942 0.071604 0.099872 0.113154 0.077083 0.091086 0.085960 0.091456 0.086326 0.085437 0.096597 0.081053 0.093252 0.090243 0.089081
qa: -0.3745 0.6821 -0.3178 -0.3165 -0.3212 -0.3033 -0.3399 0.2465 -0.3207 -0.3108 -0.2771 0.2231 0.1172 0.2274 0.0140 -0.0206 -0.2268 -0.2336 0.0284 -0.2481 0.0841 0.0942 0.1021 0.1020 0.0819 0.0922 0.0892 0.0834 0.0909 0.0716 0.0999 0.1132 0.0771 0.0911 0.0860 0.0915 0.0863 0.0854 0.0966 0.0811 0.0933 0.0902 0.0891
va: 2.0409 5.5482 2.1512 2.1334 2.1115 3.1031 3.0744 3.7267 3.9374 3.9353 3.9293 3.9617 3.8732 3.7181 4.0957 4.1198 3.9326 3.8774 3.8978 3.9070 1.0055 1.0061 1.0153 1.0198 1.0054 1.0067 1.0179 1.0040 1.0146 1.0243 1.0195 1.0091 1.0077 1.0115 1.0090 1.0093 1.0121 1.0261 0.9955 1.0096 1.0135 1.0165 1.0016
dispcorr: -0.020758620 hartree
energy: -1584.197638980298
dipole: -10.73580 12.08034 1.34454 -0.01306 0.09875 0.08569 0.64084 -1.05354 -0.41270
magnitude: 1.40906 au
magnitude: 3.58155 debye
