program: Orca
programVersion: 5.0.2
elementType: S P O O O N N C C C C C C C C C C C C C H H H H H H H H H H H H H H H H H H H H H H H
charge: 0
multiplicity: 1
keywords: wb97x-d3
keywords: def2-TZVPP
keywords: def2/J RIJCOSX
keywords: DEFGRID2
keywords: scfconv7
keywords: smallprint printgap noloewdin
keywords: NOSOSCF
formula: C13H23N2O3PS
InChI: InChI=1/C13H23N2O3PS/c1-7-16-19(20,17-10(2)3)18-11-8-14-12(15-9-11)13(4,5)6/h8-10H,7H2,1-6H3
43 atoms
S  1.730422 0.031522 1.839687
P  1.935144 -0.06587 -0.058995
O  3.12036 0.769803 -0.709335
O  0.676571 0.447896 -0.944491
O  2.142774 -1.505626 -0.707659
N  -2.829817 1.059208 -0.518225
N  -2.40612 -1.16863 0.086465
C  -4.702458 -0.319552 0.183952
C  -5.186391 0.796404 1.116031
C  -4.988012 -1.676645 0.821341
C  -5.443017 -0.218515 -1.155938
C  -3.220688 -0.138678 -0.087867
C  3.633785 1.988331 -0.125882
C  -0.627145 0.211193 -0.621068
C  -1.549593 1.234684 -0.77502
C  -1.120238 -1.003575 -0.178697
C  4.962606 2.252777 -0.800419
C  2.647963 3.126455 -0.302039
C  3.036179 -2.460092 -0.114817
C  2.254152 -3.560228 0.561717
H  -5.008479 1.780713 0.68561
H  -4.68164 0.753493 2.082775
H  -6.257658 0.693015 1.297567
H  -4.679769 -2.501086 0.179901
H  -4.470582 -1.793051 1.773659
H  -6.059174 -1.774516 1.006712
H  -5.272372 0.747258 -1.631506
H  -6.517407 -0.334985 -1.001987
H  -5.121611 -0.999686 -1.847188
H  3.791647 1.809987 0.942259
H  -1.233753 2.213375 -1.123859
H  -0.476963 -1.865647 -0.040558
H  4.836567 2.433316 -1.868499
H  5.427907 3.135448 -0.362027
H  5.647146 1.415044 -0.671027
H  2.400636 3.275402 -1.353523
H  3.083197 4.050874 0.078064
H  1.726803 2.950205 0.253687
H  3.647184 -2.848043 -0.929912
H  3.705145 -1.974699 0.600356
H  1.581111 -4.0561 -0.137527
H  2.939037 -4.311211 0.956122
H  1.671272 -3.166439 1.393792
totalener: -1584.17688233 hartree
nucrepener: 1997.10336490 hartree
electener: -3581.28024723 hartree
oneelecener: -6142.80194872 hartree
twoeener: 2561.52170149 hartree
kineticenergy: 1578.95910630 hartree
xcener: -118.046393436111 hartree
chargesum: 0.0000000
charge: -0.374088 0.681227 -0.317677 -0.316007 -0.321141 -0.339323 -0.303992 0.245639 -0.310183 -0.276946 -0.320846 0.222884 0.116453 0.228432 -0.020893 0.014933 -0.226651 -0.232329 0.028112 -0.248465 0.102048 0.091933 0.081756 0.089228 0.090805 0.083476 0.102061 0.084276 0.094245 0.071776 0.112911 0.098641 0.085969 0.077095 0.090973 0.091128 0.086188 0.085180 0.096535 0.081380 0.089796 0.093436 0.090027
qa: -0.3741 0.6812 -0.3177 -0.3160 -0.3211 -0.3393 -0.3040 0.2456 -0.3102 -0.2769 -0.3208 0.2229 0.1165 0.2284 -0.0209 0.0149 -0.2267 -0.2323 0.0281 -0.2485 0.1020 0.0919 0.0818 0.0892 0.0908 0.0835 0.1021 0.0843 0.0942 0.0718 0.1129 0.0986 0.0860 0.0771 0.0910 0.0911 0.0862 0.0852 0.0965 0.0814 0.0898 0.0934 0.0900
va: 2.0419 5.5501 2.1515 2.1344 2.1110 3.0743 3.1038 3.7278 3.9348 3.9292 3.9372 3.9623 3.8740 3.7171 4.1197 4.0952 3.9323 3.8790 3.8969 3.9070 1.0199 1.0067 1.0054 1.0180 1.0146 1.0040 1.0151 1.0054 1.0061 1.0245 1.0093 1.0197 1.0089 1.0077 1.0116 1.0094 1.0119 1.0258 0.9955 1.0098 1.0014 1.0134 1.0161
dispcorr: -0.020737293 hartree
energy: -1584.197619625527
dipole: -10.72332 12.06885 1.34553 0.01719 0.04563 0.06283 0.49763 -0.91714 -0.41952
magnitude: 1.41081 au
magnitude: 3.58600 debye
