program: Orca
programVersion: 5.0.2
elementType: S P O O O N N C C C C C C C C C C C C C H H H H H H H H H H H H H H H H H H H H H H H
charge: 0
multiplicity: 1
keywords: wb97x-d3
keywords: def2-TZVPP
keywords: def2/J RIJCOSX
keywords: DEFGRID2
keywords: scfconv7
keywords: smallprint printgap noloewdin
keywords: NOSOSCF
formula: C13H23N2O3PS
InChI: InChI=1/C13H23N2O3PS/c1-7-16-19(20,17-10(2)3)18-11-8-14-12(15-9-11)13(4,5)6/h8-10H,7H2,1-6H3
43 atoms
S  1.733026 0.893474 1.850553
P  1.718216 0.437337 -0.010461
O  2.837677 1.057805 -0.945364
O  0.460479 0.956438 -0.889114
O  1.706926 -1.129561 -0.336214
N  -2.798845 0.850235 0.653839
N  -2.623787 -0.917308 -0.886698
C  -4.717842 -0.599927 0.347643
C  -4.835915 -0.811757 1.861159
C  -5.130155 -1.876164 -0.380638
C  -5.637642 0.553028 -0.076142
C  -3.290207 -0.210143 0.01514
C  4.186139 1.29498 -0.484594
C  -0.801039 0.543666 -0.558771
C  -1.565978 1.224594 0.376417
C  -1.386179 -0.545298 -1.173793
C  5.117635 0.828959 -1.583391
C  4.3375 2.764002 -0.152609
C  1.870373 -2.155418 0.648943
C  3.32847 -2.43008 0.933643
H  -4.551608 0.083556 2.411944
H  -4.200552 -1.632736 2.197926
H  -5.865001 -1.061592 2.124974
H  -4.496192 -2.720211 -0.109692
H  -6.15837 -2.130461 -0.117187
H  -5.07778 -1.763641 -1.462779
H  -5.576632 0.735051 -1.150476
H  -5.378825 1.476858 0.440094
H  -6.675501 0.311677 0.159844
H  4.369184 0.70685 0.420705
H  -1.166648 2.087195 0.899469
H  -0.846494 -1.123095 -1.917082
H  4.975074 -0.22883 -1.802558
H  4.955333 1.394093 -2.501573
H  6.153697 0.974282 -1.277968
H  3.654287 3.055188 0.644022
H  4.140545 3.384744 -1.027098
H  5.353743 2.967392 0.185464
H  1.344115 -1.880151 1.564935
H  1.381789 -3.033575 0.227787
H  3.41737 -3.281536 1.608672
H  3.874984 -2.667206 0.021065
H  3.802635 -1.576394 1.418415
totalener: -1584.17624482 hartree
nucrepener: 1999.06688837 hartree
electener: -3583.24313319 hartree
oneelecener: -6146.69940835 hartree
twoeener: 2563.45627516 hartree
kineticenergy: 1578.97482946 hartree
xcener: -118.048569682789 hartree
chargesum: 0.0000000
charge: -0.388525 0.690122 -0.305590 -0.323293 -0.331144 -0.337346 -0.297462 0.253094 -0.312838 -0.275348 -0.318080 0.218231 0.121588 0.198744 -0.010781 -0.023839 -0.217516 -0.224310 0.036244 -0.239912 0.105490 0.089582 0.082395 0.087707 0.083812 0.089735 0.093831 0.104097 0.083250 0.049612 0.123431 0.123032 0.088479 0.089002 0.080018 0.092603 0.088420 0.080876 0.094848 0.096810 0.092607 0.087946 0.080379
qa: -0.3885 0.6901 -0.3056 -0.3233 -0.3311 -0.3373 -0.2975 0.2531 -0.3128 -0.2753 -0.3181 0.2182 0.1216 0.1987 -0.0108 -0.0238 -0.2175 -0.2243 0.0362 -0.2399 0.1055 0.0896 0.0824 0.0877 0.0838 0.0897 0.0938 0.1041 0.0832 0.0496 0.1234 0.1230 0.0885 0.0890 0.0800 0.0926 0.0884 0.0809 0.0948 0.0968 0.0926 0.0879 0.0804
va: 2.0289 5.5601 2.1388 2.1485 2.0916 3.0715 3.0863 3.7201 3.9367 3.9315 3.9368 3.9630 3.8862 3.7577 4.1349 4.1153 3.9286 3.9283 3.8543 3.9146 1.0188 1.0065 1.0054 1.0156 1.0043 1.0170 1.0058 1.0162 1.0057 1.0153 1.0146 1.0120 1.0127 1.0102 1.0084 1.0256 1.0095 1.0098 1.0156 0.9926 1.0144 1.0038 1.0153
dispcorr: -0.020850227 hartree
energy: -1584.197095042458
dipole: -4.46829 5.79337 1.32508 -8.06704 7.51387 -0.55318 1.31467 -1.58504 -0.27038
magnitude: 1.46115 au
magnitude: 3.71394 debye
