program: Orca
programVersion: 5.0.2
elementType: S P O O O N N C C C C C C C C C C C C C H H H H H H H H H H H H H H H H H H H H H H H
charge: 0
multiplicity: 1
keywords: wb97x-d3
keywords: def2-TZVPP
keywords: def2/J RIJCOSX
keywords: DEFGRID2
keywords: scfconv7
keywords: smallprint printgap noloewdin
keywords: NOSOSCF
formula: C13H23N2O3PS
InChI: InChI=1/C13H23N2O3PS/c1-7-16-19(20,17-10(2)3)18-11-8-14-12(15-9-11)13(4,5)6/h8-10H,7H2,1-6H3
43 atoms
S  1.765102 0.09793 2.374106
P  1.870835 -0.454321 0.555204
O  1.88544 0.699066 -0.555064
O  0.651149 -1.363112 -0.025241
O  3.103852 -1.403284 0.238305
N  -2.714973 -0.515524 0.960236
N  -2.364497 0.192791 -1.254019
C  -4.55376 0.549036 -0.209861
C  -4.86376 1.265081 -1.521374
C  -4.774347 1.510915 0.963202
C  -5.483842 -0.660647 -0.053662
C  -3.120786 0.051819 -0.174116
C  2.379056 2.030209 -0.290834
C  -0.620652 -0.861121 -0.063954
C  -1.476787 -0.964343 1.021899
C  -1.121315 -0.258467 -1.200833
C  3.888701 2.020815 -0.152057
C  1.896776 2.898131 -1.433002
C  3.350219 -1.980109 -1.052597
C  4.82241 -2.294946 -1.153553
H  -5.899651 1.608486 -1.513137
H  -4.7322 0.61269 -2.383609
H  -4.223669 2.134565 -1.669161
H  -4.565386 1.030117 1.917511
H  -4.134996 2.391386 0.879991
H  -5.809963 1.855008 0.974725
H  -6.525805 -0.334979 -0.055737
H  -5.296817 -1.187688 0.881551
H  -5.357653 -1.36903 -0.874497
H  1.932653 2.37315 0.647183
H  -1.147592 -1.421501 1.949017
H  -0.507541 -0.143237 -2.088329
H  4.210595 1.416638 0.696451
H  4.366935 1.640263 -1.056039
H  4.250699 3.035114 0.017051
H  2.194854 3.932256 -1.261231
H  0.810766 2.873244 -1.51835
H  2.326131 2.57954 -2.383666
H  2.748676 -2.885284 -1.152676
H  3.052991 -1.290453 -1.846279
H  5.425593 -1.390909 -1.080866
H  5.135981 -2.980497 -0.367688
H  5.032346 -2.765029 -2.11421
totalener: -1584.17684407 hartree
nucrepener: 2007.15241658 hartree
electener: -3591.32926065 hartree
oneelecener: -6162.82012904 hartree
twoeener: 2571.49086839 hartree
kineticenergy: 1578.96479116 hartree
xcener: -118.044543377000 hartree
chargesum: 0.0000000
charge: -0.352254 0.683122 -0.332151 -0.343720 -0.302140 -0.337192 -0.301074 0.254195 -0.278027 -0.312069 -0.318635 0.220073 0.116512 0.225200 -0.013214 -0.026349 -0.239235 -0.235762 0.000552 -0.221292 0.084419 0.089836 0.087969 0.105463 0.089970 0.082498 0.083705 0.104196 0.092857 0.076019 0.124403 0.114621 0.100146 0.077884 0.091914 0.083242 0.098616 0.081085 0.102676 0.092153 0.079763 0.092021 0.078002
qa: -0.3523 0.6831 -0.3322 -0.3437 -0.3021 -0.3372 -0.3011 0.2542 -0.2780 -0.3121 -0.3186 0.2201 0.1165 0.2252 -0.0132 -0.0263 -0.2392 -0.2358 0.0006 -0.2213 0.0844 0.0898 0.0880 0.1055 0.0900 0.0825 0.0837 0.1042 0.0929 0.0760 0.1244 0.1146 0.1001 0.0779 0.0919 0.0832 0.0986 0.0811 0.1027 0.0922 0.0798 0.0920 0.0780
va: 2.0971 5.5322 2.0612 2.1022 2.1315 3.0721 3.0846 3.7172 3.9321 3.9370 3.9382 3.9608 3.8765 3.7126 4.1459 4.1223 3.8830 3.9328 3.8923 3.9520 1.0042 1.0169 1.0152 1.0192 1.0064 1.0052 1.0055 1.0161 1.0059 1.0253 1.0150 1.0142 1.0249 1.0079 1.0141 1.0097 1.0085 1.0083 0.9942 0.9967 1.0074 1.0056 1.0083
dispcorr: -0.021132131 hartree
energy: -1584.197976203155
dipole: -8.65609 9.67891 1.02283 11.16576 -11.02517 0.14059 -13.55523 12.20271 -1.35251
magnitude: 1.70154 au
magnitude: 4.32497 debye
