program: Orca
programVersion: 5.0.2
elementType: S P O O O N N C C C C C C C C C C C C C H H H H H H H H H H H H H H H H H H H H H H H
charge: 0
multiplicity: 1
keywords: wb97x-d3
keywords: def2-TZVPP
keywords: def2/J RIJCOSX
keywords: DEFGRID2
keywords: scfconv7
keywords: smallprint printgap noloewdin
keywords: NOSOSCF
formula: C13H23N2O3PS
InChI: InChI=1/C13H23N2O3PS/c1-7-16-19(20,17-10(2)3)18-11-8-14-12(15-9-11)13(4,5)6/h8-10H,7H2,1-6H3
43 atoms
S  1.557827 -0.128578 2.368116
P  1.789387 0.204805 0.505892
O  3.057994 1.09127 0.167609
O  0.623262 1.049324 -0.254071
O  1.826639 -1.088985 -0.440564
N  -2.476947 -0.512883 -1.238673
N  -2.777402 0.547669 0.838396
C  -4.677402 -0.579644 -0.157762
C  -4.905894 -1.430258 1.097543
C  -5.063757 -1.382346 -1.396366
C  -5.540946 0.685113 -0.077009
C  -3.219524 -0.162722 -0.198014
C  3.34872 1.79947 -1.058294
C  -0.67284 0.613478 -0.218534
C  -1.209614 -0.130473 -1.249606
C  -1.517079 0.931809 0.834842
C  4.417962 2.81179 -0.702847
C  3.79723 0.847601 -2.149888
C  2.275579 -2.365496 0.030797
C  3.773978 -2.41483 0.224063
H  -4.305024 -2.341303 1.075592
H  -5.954069 -1.727828 1.162241
H  -4.652681 -0.879617 2.002557
H  -4.477292 -2.295954 -1.487819
H  -6.116774 -1.662834 -1.334559
H  -4.922038 -0.809804 -2.312488
H  -5.40484 1.31533 -0.957771
H  -5.297027 1.276753 0.80444
H  -6.597157 0.414995 -0.023365
H  2.447171 2.327083 -1.379523
H  -0.605057 -0.418661 -2.103391
H  -1.158125 1.50769 1.681255
H  4.086313 3.473882 0.095917
H  5.334759 2.317517 -0.379613
H  4.653089 3.424388 -1.572943
H  4.087156 1.418902 -3.032064
H  3.01011 0.157911 -2.44778
H  4.662756 0.266588 -1.82848
H  1.757865 -2.609459 0.960991
H  1.955878 -3.074691 -0.731894
H  4.072056 -3.428876 0.492103
H  4.304494 -2.138285 -0.686864
H  4.094898 -1.754849 1.029947
totalener: -1584.17467615 hartree
nucrepener: 2005.16319262 hartree
electener: -3589.33786877 hartree
oneelecener: -6158.91810811 hartree
twoeener: 2569.58023934 hartree
kineticenergy: 1578.96391193 hartree
xcener: -118.046944944612 hartree
chargesum: -0.0000000
charge: -0.355303 0.675836 -0.298795 -0.350994 -0.330372 -0.299116 -0.337437 0.255607 -0.315934 -0.277365 -0.317340 0.220800 0.120607 0.220199 -0.019742 -0.013606 -0.221075 -0.272553 0.020350 -0.235552 0.091968 0.082912 0.105389 0.089010 0.084575 0.088575 0.091178 0.104408 0.083348 0.077509 0.113405 0.123072 0.098986 0.085288 0.074821 0.095565 0.099021 0.083417 0.099469 0.093830 0.091642 0.080504 0.093894
qa: -0.3553 0.6758 -0.2988 -0.3510 -0.3304 -0.2991 -0.3374 0.2556 -0.3159 -0.2774 -0.3173 0.2208 0.1206 0.2202 -0.0197 -0.0136 -0.2211 -0.2726 0.0204 -0.2356 0.0920 0.0829 0.1054 0.0890 0.0846 0.0886 0.0912 0.1044 0.0833 0.0775 0.1134 0.1231 0.0990 0.0853 0.0748 0.0956 0.0990 0.0834 0.0995 0.0938 0.0916 0.0805 0.0939
va: 2.0971 5.5374 2.1539 2.0894 2.0597 3.0962 3.0716 3.7189 3.9385 3.9308 3.9373 3.9572 3.8801 3.7113 4.1398 4.1482 3.9223 3.9161 3.8775 3.9002 1.0061 1.0050 1.0174 1.0161 1.0039 1.0162 1.0061 1.0176 1.0055 1.0056 1.0133 1.0158 1.0116 1.0097 1.0081 1.0149 1.0165 1.0054 1.0159 0.9927 1.0144 1.0032 1.0189
dispcorr: -0.021172071 hartree
energy: -1584.195848222388
dipole: -6.59082 7.71566 1.12485 -5.40092 5.33345 -0.06747 -11.22790 9.96796 -1.25993
magnitude: 1.69034 au
magnitude: 4.29651 debye
