program: Orca
programVersion: 5.0.2
elementType: S P O O O N N C C C C C C C C C C C C C H H H H H H H H H H H H H H H H H H H H H H H
charge: 0
multiplicity: 1
keywords: wb97x-d3
keywords: def2-TZVPP
keywords: def2/J RIJCOSX
keywords: DEFGRID2
keywords: scfconv7
keywords: smallprint printgap noloewdin
keywords: NOSOSCF
formula: C13H23N2O3PS
InChI: InChI=1/C13H23N2O3PS/c1-7-16-19(20,17-10(2)3)18-11-8-14-12(15-9-11)13(4,5)6/h8-10H,7H2,1-6H3
43 atoms
S  1.93978 0.258579 2.360884
P  1.998394 -0.373444 0.565837
O  1.903214 0.723081 -0.596655
O  0.797693 -1.366684 0.082199
O  3.260411 -1.278479 0.241751
N  -2.57076 -0.478428 1.048199
N  -2.271481 -0.0062 -1.235002
C  -4.441948 0.437192 -0.247596
C  -5.15043 -0.393805 -1.324422
C  -4.422728 1.909029 -0.678641
C  -5.190859 0.303007 1.074725
C  -3.009246 -0.048549 -0.126301
C  2.284177 2.103302 -0.410029
C  -0.486987 -0.897091 0.025077
C  -1.316971 -0.897135 1.130364
C  -1.023678 -0.423935 -1.161606
C  3.7939 2.231876 -0.370123
C  1.653239 2.876981 -1.547764
C  3.471858 -1.942711 -1.013699
C  3.285446 -3.433125 -0.85613
H  -4.649876 -0.307105 -2.287789
H  -6.180024 -0.051848 -1.444232
H  -5.183719 -1.45039 -1.052833
H  -3.931068 2.53556 0.067795
H  -3.903049 2.038606 -1.627384
H  -5.44317 2.277541 -0.79821
H  -5.232558 -0.731296 1.414786
H  -6.215823 0.657374 0.950744
H  -4.726406 0.887788 1.86774
H  1.866201 2.441159 0.542762
H  -0.963201 -1.245147 2.094903
H  -0.427128 -0.391233 -2.067772
H  4.24663 1.850633 -1.286456
H  4.074051 3.280468 -0.268051
H  4.219332 1.697463 0.479464
H  1.861642 3.940262 -1.430666
H  0.57113 2.747776 -1.562564
H  2.052492 2.562142 -2.512756
H  2.811415 -1.546694 -1.788086
H  4.494892 -1.707067 -1.308098
H  3.941673 -3.832365 -0.084011
H  2.257479 -3.680852 -0.597674
H  3.527973 -3.933168 -1.794097
totalener: -1584.17619586 hartree
nucrepener: 2017.62146593 hartree
electener: -3601.79766179 hartree
oneelecener: -6183.74828666 hartree
twoeener: 2581.95062487 hartree
kineticenergy: 1578.95651483 hartree
xcener: -118.043490771000 hartree
chargesum: 0.0000000
charge: -0.352270 0.677017 -0.328120 -0.345643 -0.305546 -0.294929 -0.341299 0.254280 -0.315181 -0.319157 -0.275366 0.220766 0.117957 0.231909 -0.012265 -0.036442 -0.233317 -0.236174 0.024107 -0.232942 0.101908 0.083270 0.092235 0.093691 0.101068 0.084335 0.089502 0.083741 0.091544 0.073541 0.124058 0.114825 0.079979 0.088504 0.097954 0.083965 0.098416 0.081300 0.083113 0.095838 0.090765 0.088402 0.080662
qa: -0.3523 0.6770 -0.3281 -0.3456 -0.3055 -0.2949 -0.3413 0.2543 -0.3152 -0.3192 -0.2754 0.2208 0.1180 0.2319 -0.0123 -0.0364 -0.2333 -0.2362 0.0241 -0.2329 0.1019 0.0833 0.0922 0.0937 0.1011 0.0843 0.0895 0.0837 0.0915 0.0735 0.1241 0.1148 0.0800 0.0885 0.0980 0.0840 0.0984 0.0813 0.0831 0.0958 0.0908 0.0884 0.0807
va: 2.0983 5.5311 2.0603 2.0868 2.1256 3.0973 3.0578 3.7215 3.9363 3.9360 3.9329 3.9562 3.8832 3.6921 4.1397 4.1311 3.8846 3.9299 3.8936 3.9415 1.0182 1.0058 1.0061 1.0059 1.0170 1.0059 1.0158 1.0035 1.0161 1.0266 1.0155 1.0124 1.0092 1.0132 1.0246 1.0099 1.0088 1.0086 1.0015 0.9926 1.0050 1.0124 1.0095
dispcorr: -0.021365352 hartree
energy: -1584.197561215541
dipole: -12.93664 13.77444 0.83780 8.53972 -8.46777 0.07195 -14.53288 13.09827 -1.43461
magnitude: 1.66289 au
magnitude: 4.22673 debye
