program: Orca
programVersion: 5.0.2
elementType: S P O O O N N C C C C C C C C C C C C C H H H H H H H H H H H H H H H H H H H H H H H
charge: 0
multiplicity: 1
keywords: wb97x-d3
keywords: def2-TZVPP
keywords: def2/J RIJCOSX
keywords: DEFGRID2
keywords: scfconv7
keywords: smallprint printgap noloewdin
keywords: NOSOSCF
formula: C13H23N2O3PS
InChI: InChI=1/C13H23N2O3PS/c1-7-16-19(20,17-10(2)3)18-11-8-14-12(15-9-11)13(4,5)6/h8-10H,7H2,1-6H3
43 atoms
S  1.765325 -0.47665 2.339697
P  1.846112 0.123918 0.534042
O  3.120663 1.004261 0.202054
O  0.663065 1.120661 0.020572
O  1.743269 -1.002213 -0.605114
N  -2.716779 0.439409 1.10441
N  -2.489422 -0.180286 -1.151605
C  -4.659818 -0.447964 -0.103549
C  -5.350252 0.392442 -1.185312
C  -5.364811 -0.235505 1.232858
C  -4.733576 -1.92966 -0.492628
C  -3.200385 -0.036457 -0.034052
C  3.400047 1.583241 -1.094157
C  -0.639248 0.699005 0.017869
C  -1.443571 0.802504 1.137243
C  -1.222304 0.180922 -1.127319
C  3.231997 3.08492 -0.991296
C  4.80646 1.172656 -1.475566
C  2.117674 -2.365196 -0.366906
C  3.617153 -2.553082 -0.334814
H  -6.400085 0.105612 -1.269422
H  -4.881238 0.250895 -2.158181
H  -5.317742 1.456393 -0.943773
H  -6.409356 -0.540125 1.14603
H  -4.909437 -0.820591 2.031111
H  -5.344133 0.808938 1.542467
H  -4.251523 -2.113161 -1.452119
H  -5.775838 -2.244373 -0.570503
H  -4.253207 -2.561822 0.256243
H  2.698843 1.189161 -1.836122
H  -1.05275 1.188656 2.072509
H  -0.646555 0.064785 -2.040131
H  3.910559 3.502522 -0.246929
H  3.455936 3.55121 -1.951027
H  2.212762 3.352925 -0.717431
H  4.900009 0.089127 -1.540506
H  5.531527 1.535065 -0.746218
H  5.066989 1.591065 -2.447718
H  1.66589 -2.706406 0.566889
H  1.67018 -2.927323 -1.185921
H  4.066524 -2.039143 0.515034
H  3.849133 -3.61394 -0.23778
H  4.084965 -2.192879 -1.251057
totalener: -1584.17612719 hartree
nucrepener: 2005.08502367 hartree
electener: -3589.26115086 hartree
oneelecener: -6158.67905138 hartree
twoeener: 2569.41790053 hartree
kineticenergy: 1578.95142564 hartree
xcener: -118.042751283080 hartree
chargesum: -0.0000000
charge: -0.352208 0.676416 -0.306419 -0.342264 -0.331664 -0.294784 -0.341938 0.253931 -0.316888 -0.275460 -0.317706 0.220961 0.114118 0.218611 -0.011200 -0.021179 -0.238127 -0.226383 0.030097 -0.250130 0.083190 0.102192 0.092665 0.083779 0.091411 0.089607 0.101845 0.083560 0.093496 0.064245 0.123024 0.112463 0.088621 0.081662 0.096528 0.087683 0.090862 0.083044 0.096652 0.094595 0.097876 0.095058 0.078157
qa: -0.3522 0.6764 -0.3064 -0.3423 -0.3317 -0.2948 -0.3419 0.2539 -0.3169 -0.2755 -0.3177 0.2210 0.1141 0.2186 -0.0112 -0.0212 -0.2381 -0.2264 0.0301 -0.2501 0.0832 0.1022 0.0927 0.0838 0.0914 0.0896 0.1018 0.0836 0.0935 0.0642 0.1230 0.1125 0.0886 0.0817 0.0965 0.0877 0.0909 0.0830 0.0967 0.0946 0.0979 0.0951 0.0782
va: 2.1000 5.5338 2.1273 2.0933 2.0520 3.0975 3.0703 3.7219 3.9365 3.9325 3.9369 3.9556 3.8993 3.7087 4.1387 4.1441 3.9282 3.9283 3.8719 3.9052 1.0059 1.0175 1.0059 1.0036 1.0157 1.0161 1.0175 1.0056 1.0060 1.0084 1.0158 1.0135 1.0088 1.0086 1.0159 1.0121 1.0106 1.0100 1.0163 0.9916 1.0155 1.0155 1.0028
dispcorr: -0.021292042 hartree
energy: -1584.197419232223
dipole: -8.02897 9.02366 0.99469 -3.69273 3.61239 -0.08034 -13.17780 11.73771 -1.44010
magnitude: 1.75207 au
magnitude: 4.45340 debye
