program: Orca
programVersion: 5.0.2
elementType: S P O O O N N C C C C C C C C C C C C C H H H H H H H H H H H H H H H H H H H H H H H
charge: 0
multiplicity: 1
keywords: wb97x-d3
keywords: def2-TZVPP
keywords: def2/J RIJCOSX
keywords: DEFGRID2
keywords: scfconv7
keywords: smallprint printgap noloewdin
keywords: NOSOSCF
formula: C13H23N2O3PS
InChI: InChI=1/C13H23N2O3PS/c1-7-16-19(20,17-10(2)3)18-11-8-14-12(15-9-11)13(4,5)6/h8-10H,7H2,1-6H3
43 atoms
S  1.885389 -0.39432 1.812112
P  1.940872 -0.313076 -0.102817
O  1.878652 1.095704 -0.829808
O  0.704236 -1.053614 -0.857069
O  3.17147 -1.029182 -0.814752
N  -2.485127 0.606544 -1.130412
N  -2.554688 -0.874578 0.694042
C  -4.548811 0.437276 0.129804
C  -4.596272 1.954103 0.35026
C  -5.140802 -0.2744 1.342473
C  -5.36133 0.081748 -1.121643
C  -3.107463 0.026172 -0.105921
C  2.48481 2.337667 -0.404105
C  -0.580856 -0.671542 -0.581929
C  -1.234061 0.264548 -1.367107
C  -1.298065 -1.22157 0.463711
C  1.61041 3.025223 0.625723
C  3.921803 2.162864 0.049761
C  3.880917 -2.11569 -0.205036
C  3.09778 -3.408066 -0.233004
H  -5.627906 2.279578 0.495349
H  -4.188032 2.492182 -0.504327
H  -4.030394 2.244526 1.237192
H  -5.134575 -1.357114 1.221807
H  -4.591726 -0.045758 2.255452
H  -6.175618 0.042959 1.482632
H  -6.401488 0.386682 -0.993772
H  -5.352789 -0.993775 -1.307694
H  -4.96715 0.581973 -2.005511
H  2.481826 2.929042 -1.32164
H  -0.730481 0.735474 -2.205119
H  -0.849103 -1.955782 1.123767
H  1.602731 2.485829 1.571503
H  1.988767 4.031282 0.80975
H  0.583768 3.115545 0.271069
H  3.986923 1.606012 0.984689
H  4.362274 3.145528 0.219743
H  4.522311 1.656422 -0.705179
H  4.801137 -2.204395 -0.780803
H  4.145661 -1.847081 0.820168
H  2.786045 -3.664539 -1.244393
H  3.723214 -4.217236 0.14475
H  2.213576 -3.353317 0.401431
totalener: -1584.17424050 hartree
nucrepener: 2025.72684745 hartree
electener: -3609.90108794 hartree
oneelecener: -6200.21898565 hartree
twoeener: 2590.31789770 hartree
kineticenergy: 1578.96649641 hartree
xcener: -118.050492151539 hartree
chargesum: 0.0000000
charge: -0.391558 0.716793 -0.333586 -0.336254 -0.318335 -0.339130 -0.297384 0.253028 -0.316761 -0.274102 -0.318113 0.220993 0.138881 0.222830 -0.033331 -0.005894 -0.257979 -0.268729 0.020687 -0.224291 0.083387 0.101832 0.092361 0.089200 0.090360 0.083397 0.083397 0.092924 0.102841 0.073462 0.122272 0.115315 0.100136 0.086250 0.095491 0.091524 0.089578 0.105408 0.096231 0.090154 0.091082 0.085069 0.080563
qa: -0.3916 0.7168 -0.3336 -0.3363 -0.3183 -0.3391 -0.2974 0.2530 -0.3168 -0.2741 -0.3181 0.2210 0.1389 0.2228 -0.0333 -0.0059 -0.2580 -0.2687 0.0207 -0.2243 0.0834 0.1018 0.0924 0.0892 0.0904 0.0834 0.0834 0.0929 0.1028 0.0735 0.1223 0.1153 0.1001 0.0863 0.0955 0.0915 0.0896 0.1054 0.0962 0.0902 0.0911 0.0851 0.0806
va: 2.0206 5.5268 2.1356 2.1170 2.1236 3.0567 3.0998 3.7224 3.9357 3.9319 3.9362 3.9599 3.8999 3.7215 4.1354 4.1316 3.9274 3.8859 3.8854 3.9040 1.0057 1.0184 1.0062 1.0165 1.0158 1.0038 1.0056 1.0061 1.0174 0.9901 1.0128 1.0159 1.0188 1.0102 1.0082 1.0277 1.0107 1.0098 0.9914 1.0137 1.0072 1.0113 1.0193
dispcorr: -0.021453925 hartree
energy: -1584.195694422037
dipole: -11.94492 13.15381 1.20889 8.03255 -7.80034 0.23221 1.97479 -2.44908 -0.47429
magnitude: 1.31920 au
magnitude: 3.35314 debye
