program: Orca
programVersion: 5.0.2
elementType: S P O O O N N C C C C C C C C C C C C C H H H H H H H H H H H H H H H H H H H H H H H
charge: 0
multiplicity: 1
keywords: wb97x-d3
keywords: def2-TZVPP
keywords: def2/J RIJCOSX
keywords: DEFGRID2
keywords: scfconv7
keywords: smallprint printgap noloewdin
keywords: NOSOSCF
formula: C13H23N2O3PS
InChI: InChI=1/C13H23N2O3PS/c1-7-16-19(20,17-10(2)3)18-11-8-14-12(15-9-11)13(4,5)6/h8-10H,7H2,1-6H3
43 atoms
S  3.627922 -0.621007 1.330839
P  1.9999 -0.252885 0.409721
O  1.611009 1.268067 0.149981
O  0.687257 -0.752352 1.221621
O  1.826769 -0.902178 -1.044215
N  -2.515739 -1.218427 -0.386503
N  -2.494907 0.867985 0.694166
C  -4.501971 0.216144 -0.498867
C  -4.477839 1.486109 -1.359184
C  -5.37815 0.45704 0.736786
C  -5.072044 -0.942333 -1.312635
C  -3.085475 -0.073236 -0.040836
C  2.592496 2.307702 -0.04794
C  -0.581338 -0.509957 0.766738
C  -1.272189 -1.436766 0.012195
C  -1.258419 0.655045 1.095418
C  3.217155 2.197794 -1.424874
C  1.867689 3.618243 0.170337
C  2.595653 -2.029045 -1.480958
C  2.106496 -3.333697 -0.893843
H  -4.077934 2.333524 -0.803444
H  -5.488183 1.739155 -1.685209
H  -3.866683 1.347256 -2.252937
H  -5.420194 -0.429203 1.372546
H  -5.002545 1.285879 1.335389
H  -6.399184 0.693499 0.432214
H  -5.105009 -1.866325 -0.736017
H  -4.483729 -1.138824 -2.2085
H  -6.090317 -0.703578 -1.624466
H  3.368932 2.185607 0.713738
H  -0.817595 -2.380818 -0.268999
H  -0.785536 1.421884 1.69963
H  3.789322 1.276388 -1.534594
H  2.457601 2.23043 -2.206281
H  3.90591 3.027414 -1.584137
H  1.426915 3.664975 1.165846
H  1.074815 3.760385 -0.564748
H  2.568226 4.447583 0.076772
H  2.500014 -2.030546 -2.566324
H  3.6476 -1.870749 -1.232422
H  2.692409 -4.156525 -1.303886
H  2.223856 -3.354631 0.189588
H  1.060956 -3.518826 -1.139868
totalener: -1584.17514985 hartree
nucrepener: 2019.42955096 hartree
electener: -3603.60470081 hartree
oneelecener: -6187.30122979 hartree
twoeener: 2583.69652898 hartree
kineticenergy: 1578.96476996 hartree
xcener: -118.047314310819 hartree
chargesum: -0.0000000
charge: -0.360268 0.675857 -0.313582 -0.328426 -0.322493 -0.302209 -0.340716 0.248693 -0.317601 -0.315035 -0.275924 0.224392 0.104087 0.229588 -0.019990 -0.010839 -0.223739 -0.239626 0.032465 -0.257621 0.103344 0.083783 0.091896 0.092356 0.103592 0.083056 0.089943 0.088342 0.084528 0.073357 0.116536 0.110853 0.082352 0.091255 0.084595 0.092332 0.090122 0.083867 0.100685 0.091403 0.094303 0.099480 0.081007
qa: -0.3603 0.6759 -0.3136 -0.3284 -0.3225 -0.3022 -0.3407 0.2487 -0.3176 -0.3150 -0.2759 0.2244 0.1041 0.2296 -0.0200 -0.0108 -0.2237 -0.2396 0.0325 -0.2576 0.1033 0.0838 0.0919 0.0924 0.1036 0.0831 0.0899 0.0883 0.0845 0.0734 0.1165 0.1109 0.0824 0.0913 0.0846 0.0923 0.0901 0.0839 0.1007 0.0914 0.0943 0.0995 0.0810
va: 2.0795 5.5327 2.1248 2.1346 2.0716 3.1042 3.0682 3.7246 3.9371 3.9360 3.9310 3.9597 3.8980 3.7218 4.1278 4.1296 3.8788 3.9257 3.8551 3.9201 1.0173 1.0056 1.0059 1.0060 1.0179 1.0054 1.0159 1.0163 1.0039 1.0223 1.0063 1.0162 1.0233 1.0099 1.0116 1.0106 1.0072 1.0101 0.9905 1.0148 1.0148 1.0160 1.0042
dispcorr: -0.021404706 hartree
energy: -1584.196554554179
dipole: -17.50838 17.91623 0.40785 7.67021 -7.35271 0.31750 -14.12801 13.21813 -0.90988
magnitude: 1.04644 au
magnitude: 2.65984 debye
