program: Orca
programVersion: 5.0.2
elementType: S P O O O N N C C C C C C C C C C C C C H H H H H H H H H H H H H H H H H H H H H H H
charge: 0
multiplicity: 1
keywords: wb97x-d3
keywords: def2-TZVPP
keywords: def2/J RIJCOSX
keywords: DEFGRID2
keywords: scfconv7
keywords: smallprint printgap noloewdin
keywords: NOSOSCF
formula: C13H23N2O3PS
InChI: InChI=1/C13H23N2O3PS/c1-7-16-19(20,17-10(2)3)18-11-8-14-12(15-9-11)13(4,5)6/h8-10H,7H2,1-6H3
43 atoms
S  1.737445 -0.00005 1.859426
P  1.940859 -0.186024 -0.032708
O  2.158866 1.133632 -0.892377
O  0.681508 -0.826938 -0.830154
O  3.119533 -1.12422 -0.54623
N  -2.830292 -1.349421 -0.328037
N  -2.389791 0.94094 -0.063923
C  -4.679273 0.178579 0.182294
C  -4.809545 0.640801 1.639496
C  -5.533638 -1.066883 -0.036874
C  -5.156595 1.298477 -0.749359
C  -3.21438 -0.102795 -0.092426
C  3.119594 2.136866 -0.486956
C  -0.620802 -0.541628 -0.546649
C  -1.5448 -1.568517 -0.546694
C  -1.108699 0.73273 -0.292434
C  3.945839 2.485557 -1.706477
C  2.368572 3.318156 0.09007
C  3.597137 -2.24214 0.213105
C  2.637931 -3.410115 0.195507
H  -5.851659 0.87034 1.869242
H  -4.216338 1.535946 1.825131
H  -4.480433 -0.134341 2.333812
H  -5.462494 -1.430444 -1.062043
H  -5.239533 -1.884181 0.620028
H  -6.580343 -0.831589 0.16359
H  -6.204962 1.528487 -0.55137
H  -5.07473 1.006023 -1.797719
H  -4.576277 2.208712 -0.606941
H  3.773653 1.721036 0.287034
H  -1.234211 -2.59103 -0.737979
H  -0.457867 1.600513 -0.279298
H  3.320186 2.891792 -2.501994
H  4.690967 3.237856 -1.447486
H  4.468658 1.611237 -2.092757
H  1.685795 3.744925 -0.646071
H  3.070303 4.097393 0.388366
H  1.799149 3.025078 0.971651
H  4.544568 -2.509585 -0.2532
H  3.799875 -1.924871 1.238689
H  2.383048 -3.702231 -0.822463
H  3.102923 -4.265684 0.685912
H  1.719149 -3.18309 0.736133
totalener: -1584.17717879 hartree
nucrepener: 2002.86579588 hartree
electener: -3587.04297467 hartree
oneelecener: -6154.32611860 hartree
twoeener: 2567.28314393 hartree
kineticenergy: 1578.97039138 hartree
xcener: -118.048200840327 hartree
chargesum: 0.0000000
charge: -0.371645 0.681904 -0.328793 -0.313872 -0.321458 -0.300915 -0.341671 0.245502 -0.317912 -0.274962 -0.311046 0.221336 0.128796 0.228935 -0.019733 0.010201 -0.225580 -0.257387 0.019127 -0.230987 0.083286 0.102916 0.095151 0.088610 0.089841 0.083117 0.082054 0.089933 0.102610 0.059035 0.111843 0.103135 0.085482 0.079308 0.094233 0.087239 0.095003 0.099684 0.096409 0.092010 0.091002 0.086909 0.081354
qa: -0.3716 0.6819 -0.3288 -0.3139 -0.3215 -0.3009 -0.3417 0.2455 -0.3179 -0.2750 -0.3110 0.2213 0.1288 0.2289 -0.0197 0.0102 -0.2256 -0.2574 0.0191 -0.2310 0.0833 0.1029 0.0952 0.0886 0.0898 0.0831 0.0821 0.0899 0.1026 0.0590 0.1118 0.1031 0.0855 0.0793 0.0942 0.0872 0.0950 0.0997 0.0964 0.0920 0.0910 0.0869 0.0814
va: 2.0463 5.5458 2.1130 2.1338 2.1336 3.0961 3.0842 3.7299 3.9368 3.9303 3.9334 3.9649 3.8809 3.7155 4.1110 4.1056 3.9370 3.9080 3.8878 3.8929 1.0049 1.0155 1.0063 1.0149 1.0178 1.0041 1.0059 1.0068 1.0200 1.0174 1.0098 1.0167 1.0103 1.0082 1.0129 1.0059 1.0127 1.0206 0.9915 1.0142 1.0060 1.0122 1.0187
dispcorr: -0.020883483 hartree
energy: -1584.198062276291
dipole: -11.72861 13.09249 1.36388 6.07591 -6.10238 -0.02647 -0.94967 0.52148 -0.42819
magnitude: 1.42976 au
magnitude: 3.63416 debye
