program: Orca
programVersion: 5.0.2
elementType: S P O O O N N C C C C C C C C C C C C C H H H H H H H H H H H H H H H H H H H H H H H
charge: 0
multiplicity: 1
keywords: wb97x-d3
keywords: def2-TZVPP
keywords: def2/J RIJCOSX
keywords: DEFGRID2
keywords: scfconv7
keywords: smallprint printgap noloewdin
keywords: NOSOSCF
formula: C13H23N2O3PS
InChI: InChI=1/C13H23N2O3PS/c1-7-16-19(20,17-10(2)3)18-11-8-14-12(15-9-11)13(4,5)6/h8-10H,7H2,1-6H3
43 atoms
S  1.556074 0.657262 1.812177
P  1.786385 0.003403 0.027377
O  3.072017 0.475563 -0.774701
O  0.625749 0.425312 -1.030448
O  1.81013 -1.575539 -0.17037
N  -2.711351 0.967014 0.234472
N  -2.623245 -1.136069 -0.813147
C  -4.726631 -0.380817 0.196111
C  -4.862405 -0.339111 1.723701
C  -5.248044 -1.716128 -0.326565
C  -5.542663 0.76382 -0.416255
C  -3.264653 -0.17998 -0.156577
C  3.528226 1.848881 -0.714632
C  -0.690196 0.213484 -0.716704
C  -1.43665 1.163239 -0.03557
C  -1.342912 -0.943808 -1.091914
C  4.777018 1.899715 0.139178
C  3.746309 2.316533 -2.137361
C  2.277432 -2.463538 0.854896
C  3.777578 -2.406501 1.029536
H  -4.286566 -1.137076 2.195892
H  -5.90722 -0.470481 2.011114
H  -4.516315 0.611882 2.12669
H  -4.702002 -2.559304 0.095247
H  -6.299915 -1.827473 -0.057286
H  -5.169702 -1.787032 -1.411098
H  -6.596171 0.655598 -0.151853
H  -5.47378 0.762019 -1.505584
H  -5.200563 1.733106 -0.056178
H  2.755496 2.466185 -0.244633
H  -0.986978 2.09464 0.292006
H  -0.82233 -1.728111 -1.631706
H  5.153467 2.921659 0.190078
H  4.564125 1.570937 1.156006
H  5.563764 1.269747 -0.277511
H  4.075567 3.35571 -2.138734
H  2.826545 2.253535 -2.717736
H  4.510744 1.72015 -2.636247
H  1.769021 -2.231858 1.793478
H  1.958366 -3.453096 0.530926
H  4.088064 -3.173067 1.73986
H  4.296682 -2.585936 0.089004
H  4.097492 -1.443103 1.426515
totalener: -1584.17817272 hartree
nucrepener: 2000.91824695 hartree
electener: -3585.09641967 hartree
oneelecener: -6150.51885261 hartree
twoeener: 2565.42243294 hartree
kineticenergy: 1578.96835844 hartree
xcener: -118.045749173276 hartree
chargesum: -0.0000000
charge: -0.387075 0.704932 -0.318299 -0.341487 -0.327064 -0.338190 -0.299073 0.252803 -0.316413 -0.275910 -0.315836 0.222660 0.134731 0.212867 -0.009560 -0.021460 -0.236441 -0.225839 0.017812 -0.221747 0.093236 0.082978 0.104129 0.088866 0.084107 0.089198 0.083195 0.091160 0.103327 0.058354 0.116305 0.122260 0.086018 0.091742 0.086738 0.080519 0.094881 0.083601 0.096088 0.095720 0.086414 0.091060 0.078696
qa: -0.3871 0.7049 -0.3183 -0.3415 -0.3271 -0.3382 -0.2991 0.2528 -0.3164 -0.2759 -0.3158 0.2227 0.1347 0.2129 -0.0096 -0.0215 -0.2364 -0.2258 0.0178 -0.2217 0.0932 0.0830 0.1041 0.0889 0.0841 0.0892 0.0832 0.0912 0.1033 0.0584 0.1163 0.1223 0.0860 0.0917 0.0867 0.0805 0.0949 0.0836 0.0961 0.0957 0.0864 0.0911 0.0787
va: 2.0346 5.5441 2.1174 2.1227 2.1314 3.0718 3.0908 3.7233 3.9383 3.9306 3.9360 3.9580 3.8665 3.7312 4.1435 4.1329 3.9186 3.9402 3.8900 3.8970 1.0061 1.0052 1.0171 1.0164 1.0040 1.0158 1.0054 1.0060 1.0184 1.0207 1.0157 1.0123 1.0125 1.0215 1.0074 1.0083 1.0131 1.0099 1.0122 0.9923 1.0115 1.0073 1.0170
dispcorr: -0.020703528 hartree
energy: -1584.198876251967
dipole: -6.02160 7.24642 1.22483 -1.23555 1.12261 -0.11294 0.64433 -1.00264 -0.35831
magnitude: 1.28115 au
magnitude: 3.25642 debye
