program: Orca
programVersion: 5.0.2
elementType: S P O O O N N C C C C C C C C C C C C C H H H H H H H H H H H H H H H H H H H H H H H
charge: 0
multiplicity: 1
keywords: wb97x-d3
keywords: def2-TZVPP
keywords: def2/J RIJCOSX
keywords: DEFGRID2
keywords: scfconv7
keywords: smallprint printgap noloewdin
keywords: NOSOSCF
formula: C13H23N2O3PS
InChI: InChI=1/C13H23N2O3PS/c1-7-16-19(20,17-10(2)3)18-11-8-14-12(15-9-11)13(4,5)6/h8-10H,7H2,1-6H3
43 atoms
S  1.662687 0.304815 1.985784
P  1.776396 0.055142 0.091512
O  3.046243 0.635824 -0.661969
O  0.59028 0.744722 -0.779412
O  1.709536 -1.439317 -0.45256
N  -2.748816 0.887372 0.580443
N  -2.640495 -0.848582 -1.000842
C  -4.764033 -0.385892 0.133231
C  -5.560756 0.877933 -0.214518
C  -4.955511 -0.710738 1.619595
C  -5.261747 -1.553923 -0.713655
C  -3.29395 -0.107736 -0.117153
C  3.623812 1.918119 -0.323006
C  -0.718976 0.435962 -0.528934
C  -1.473675 1.156401 0.383717
C  -1.36049 -0.581634 -1.207157
C  4.913668 1.675336 0.431585
C  3.815795 2.681337 -1.616317
C  2.209602 -2.54809 0.307269
C  3.720201 -2.578375 0.359945
H  -5.451742 1.138958 -1.268795
H  -5.232996 1.728874 0.381402
H  -6.622928 0.716817 -0.022084
H  -4.404833 -1.60913 1.90406
H  -4.616263 0.108497 2.252215
H  -6.011272 -0.889582 1.830749
H  -6.319545 -1.728152 -0.508876
H  -4.720817 -2.474103 -0.49435
H  -5.15325 -1.358791 -1.780024
H  2.93195 2.466118 0.324655
H  -1.03103 1.964533 0.956611
H  -0.831873 -1.186339 -1.936778
H  4.723553 1.141147 1.362076
H  5.615576 1.095852 -0.169584
H  5.386792 2.625121 0.681389
H  4.498695 2.156905 -2.285552
H  4.238089 3.664352 -1.407939
H  2.868399 2.824436 -2.134832
H  1.786531 -2.517783 1.313777
H  1.818932 -3.429878 -0.198789
H  4.119296 -1.74291 0.935001
H  4.046353 -3.49751 0.847211
H  4.155276 -2.552328 -0.638398
totalener: -1584.17831050 hartree
nucrepener: 1997.74246944 hartree
electener: -3581.92077994 hartree
oneelecener: -6144.16146383 hartree
twoeener: 2562.24068389 hartree
kineticenergy: 1578.97116739 hartree
xcener: -118.046492413450 hartree
chargesum: 0.0000000
charge: -0.385173 0.701237 -0.316479 -0.339741 -0.326555 -0.338336 -0.298607 0.252652 -0.317174 -0.314654 -0.274437 0.220582 0.135226 0.210099 -0.010019 -0.018956 -0.239007 -0.226384 0.018238 -0.222206 0.092166 0.104018 0.082821 0.091963 0.104954 0.082403 0.083736 0.088449 0.088848 0.059718 0.116952 0.121329 0.091979 0.086385 0.087330 0.083401 0.080806 0.094805 0.095792 0.095137 0.078576 0.087229 0.090897
qa: -0.3852 0.7012 -0.3165 -0.3397 -0.3266 -0.3383 -0.2986 0.2527 -0.3172 -0.3147 -0.2744 0.2206 0.1352 0.2101 -0.0100 -0.0190 -0.2390 -0.2264 0.0182 -0.2222 0.0922 0.1040 0.0828 0.0920 0.1050 0.0824 0.0837 0.0884 0.0888 0.0597 0.1170 0.1213 0.0920 0.0864 0.0873 0.0834 0.0808 0.0948 0.0958 0.0951 0.0786 0.0872 0.0909
va: 2.0387 5.5469 2.1182 2.1269 2.1277 3.0719 3.0899 3.7234 3.9358 3.9377 3.9311 3.9599 3.8618 3.7372 4.1437 4.1273 3.9162 3.9409 3.8908 3.8973 1.0060 1.0175 1.0058 1.0063 1.0176 1.0051 1.0040 1.0163 1.0164 1.0209 1.0165 1.0133 1.0209 1.0071 1.0132 1.0099 1.0083 1.0129 1.0123 0.9923 1.0157 1.0117 1.0071
dispcorr: -0.020701264 hartree
energy: -1584.199011768498
dipole: -5.84246 7.08274 1.24028 -2.17980 2.11268 -0.06713 -1.03026 0.58721 -0.44305
magnitude: 1.31875 au
magnitude: 3.35199 debye
