program: Gaussian 09
title: 000006003
version: EM64L-G09RevD.01
frameworkgroup: C1[X(C19H25N2S)]
method: RPBEPBE
basis: SDD
operation: Freq
keyword: #p
keyword: freq=noraman
keyword: PBEPBE/SDD
title: #p freq=noraman PBEPBE/SDD
converged: YES YES NO NO
title: Mulliken charges:
elementType: S N N C C C C C C C C C C C C C C C C C C C H H H H H H H H H H H H H H H H H H H H H H H H H
charge: 0.239657 -0.108888 -0.334632 -0.359121 -0.121756 -0.296871 -0.569860 -0.569343 -0.707907 0.462541 0.469340 -0.691770 -0.316007 -0.315425 -0.334457 -0.369527 -0.267710 -0.257142 -0.236109 -0.221550 -0.231002 -0.233422 0.275598 0.272470 0.254555 0.255512 0.261344 0.267617 0.283038 0.257163 0.258673 0.272367 0.272845 0.190312 0.238886 0.284696 0.271002 0.254647 0.242525 0.222701 0.224177 0.264230 0.263169 0.242056 0.241679 0.249771 0.249932
chargesum: 1.00000
title: Mulliken charges with hydrogens summed into heavy atoms:
elementType: S N N C C C C C C C C C C C C C C C C C C C
charge: 0.239657 -0.108888 -0.334632 0.188946 0.132799 0.219985 0.237958 0.234542 0.005987 0.462541 0.469340 0.076403 -0.316007 -0.315425 -0.111756 -0.145350 -0.003480 0.006027 0.005947 0.020128 0.018769 0.016510
polarizability: 2.50190525e+02 4.90310777e+00 2.76605703e+02 -2.41212264e+01 2.19229902e+00 1.63328776e+02
1716.lowfreq: -7.5965 0.0020 0.0022 0.0023 6.8692 11.5688 21.5443 40.2319 47.4661
frequency: 21.0416 39.8909 47.3411 63.8529 80.3121 96.1632 106.2590 126.7840 141.6243 159.6091 173.9074 195.3045 232.5081 256.8121 261.0251 265.7760 271.6547 279.6001 295.3640 331.1282 341.5604 360.2310 372.6986 391.7112 405.9959 423.5425 441.5326 445.2440 458.4381 467.1167 492.9619 511.3452 526.8253 561.2592 596.3821 617.3363 659.9797 666.2867 708.8159 723.6912 725.0400 748.3842 760.7012 768.4884 783.1366 806.7797 857.7854 861.3695 868.8531 876.9185 893.8728 910.5455 940.8105 942.2390 954.4918 965.2482 988.4911 988.9755 1017.8842 1021.3329 1030.6529 1037.5648 1049.7319 1064.8946 1072.2528 1084.2431 1111.4519 1119.4645 1126.8095 1135.0930 1137.7874 1174.1664 1174.5462 1178.1838 1209.1750 1218.3733 1220.7968 1233.5020 1260.7616 1268.5656 1280.0636 1311.4938 1341.3296 1350.2852 1363.1694 1365.6954 1371.0753 1375.5740 1397.5882 1410.2432 1424.3437 1425.9235 1430.9919 1441.9839 1448.2343 1452.5311 1456.9885 1462.2046 1466.9224 1469.0558 1475.8988 1481.5912 1484.3607 1487.9928 1492.6779 1500.1882 1571.6976 1581.0658 1584.1773 1599.4682 2982.8281 3009.6091 3016.8571 3021.4775 3028.8476 3034.4000 3037.5443 3074.9427 3086.2481 3098.0301 3100.5240 3116.8189 3120.6095 3126.6512 3133.0774 3138.4155 3145.8661 3146.6295 3146.9671 3155.8439 3155.9776 3156.7607 3172.3589 3175.1657 3175.5990
redmass: 3.8741 4.8226 3.4672 4.6039 2.2493 2.1444 3.2459 2.2602 3.1819 5.0934 1.9143 1.8266 2.0495 3.1418 2.1115 1.7789 1.8067 1.3045 2.3017 5.2914 2.2083 3.5612 3.1942 2.9411 5.6142 5.8258 2.6892 3.0826 2.8033 2.9115 3.1440 3.5198 4.0245 5.2819 4.1157 5.1681 6.1567 6.4037 4.4098 3.8937 3.5389 2.8319 1.3232 1.5545 1.9922 1.4318 1.4814 1.3789 2.2557 2.8427 1.8787 2.7411 1.4490 1.3834 2.1751 2.6938 1.3372 1.3372 1.8704 5.6898 2.7736 2.1034 3.3685 1.5595 1.4620 2.3410 1.9279 1.6236 2.0049 1.5482 1.6866 1.1012 1.0744 1.8818 1.7235 1.7453 3.1129 1.7966 1.5017 1.6082 1.3557 1.2485 1.2862 1.3243 8.1293 1.3026 2.9516 1.9366 1.2112 1.1765 1.2554 1.9051 2.1707 1.1427 1.1386 2.2733 1.0892 1.7646 1.2802 1.0680 1.0556 1.0475 1.0439 1.0733 1.0541 1.0524 6.4896 6.5112 7.0193 6.7779 1.0384 1.0376 1.0839 1.0584 1.0352 1.0538 1.0395 1.0969 1.1063 1.0975 1.1008 1.1073 1.1031 1.0883 1.0872 1.1048 1.0884 1.1015 1.0905 1.0943 1.1044 1.0946 1.1026 1.1006 1.1007
irintensity: 0.3724 1.0736 0.8521 1.9850 1.1362 0.5556 0.6414 1.7433 0.1879 1.5461 3.6078 0.8778 0.2847 1.3209 2.5356 0.8487 2.1885 1.2236 0.0246 2.5790 0.7005 0.4576 0.8751 2.7376 0.9643 2.0957 1.7259 3.2469 4.2016 15.0611 9.0512 6.4104 2.5575 2.8430 19.3997 5.5873 0.8210 13.0661 0.1717 10.7935 2.6113 32.1106 25.1816 106.3982 49.2471 11.9187 4.6851 0.9833 19.3230 1.9796 3.9439 22.6483 0.2917 0.1423 14.8903 4.5833 0.1294 0.1113 37.8701 21.8117 6.3035 3.2836 4.6819 0.6317 2.1504 36.2891 28.8298 10.3082 26.0992 12.2029 2.8963 0.9441 0.2553 10.3760 1.4155 0.1222 45.5118 22.4474 3.2029 10.5505 10.8271 1.7392 7.9927 18.0054 5.8884 0.4885 5.2848 2.3229 15.1698 24.1153 29.2260 15.1469 24.9852 10.2784 16.0492 133.6062 7.8836 10.2125 21.5581 7.1189 14.9418 6.9468 35.5152 33.9882 62.2949 33.5656 8.0413 0.0469 0.9049 11.0574 41.3861 3.1594 5.8302 6.5564 9.0548 5.9694 11.2421 32.4881 1.7012 6.4892 5.5474 8.4899 18.9054 13.3754 13.8895 8.3075 1.9666 7.8469 1.5134 8.8458 3.4813 15.8536 2.3186 17.7168 8.2999
temp: 298.150 k
press: 1.00000 atm
elementType: 16 7 7 6 6 6 6 6 6 6 6 6 6 6 6 6 6 6 6 6 6 6 1 1 1 1 1 1 1 1 1 1 1 1 1 1 1 1 1 1 1 1 1 1 1 1 1
symmnumber: 1
zpe: 1047158.0 jmol-1
zpe.correction: 0.398841 hartree
zpe.thermalcorrener: 0.420556 hartree
zpe.thermalcorrenthalpy: 0.421500 hartree
zpe.thermalcorrgfe: 0.348383 hartree
zpe.sumelectzpe: -1244.692525 hartree
zpe.sumelectthermal: -1244.670811 hartree
zpe.sumelectthermalent: -1244.669866 hartree
zpe.sumelectthermalfe: -1244.742984 hartree
dipole: 13.9573 -1.1933 1.0885
dipole: 14.0505
quadrupole: -62.8667 -109.8595 -130.4576
quadrupole: -3.8776 1.6115 -0.6330
quadrupole: 38.1945 -8.7982 -29.3964 -3.8776 1.6115 -0.6330
hfenergy: -1245.0913663 hartree
pointgroup: C01 [X(C19H25N2S1)]
dipole: 5.488563 -0.6392475 0.1563516 debye
polarizability: 248.0608644|6.4421659|276.1137373|-27.8962695|5.0858629|165.9504018 unknown
InChI: InChI=1S/C19H25N2S/c1-5-21(3,4)14-15(2)20-16-10-6-8-12-18(16)22-19-13-9-7-11-17(19)20/h6-13,15H,5,14H2,1-4H3
charge 1 multiplicity 1
47 atoms
S  -2.929914 0.266661 1.408133
N  3.585347 -0.437797 0.375225
N  -0.275816 -0.048718 -0.11538
C  2.166914 -0.089712 -0.184385
C  0.926615 -0.254947 0.753468
C  4.530713 -0.763057 -0.822213
C  4.170538 0.720548 1.178828
C  3.530833 -1.685634 1.253071
C  0.910502 0.647835 2.008742
C  -0.855931 1.273395 -0.217642
C  -1.171332 -1.178049 -0.256405
C  4.683716 0.348702 -1.864369
C  -2.084629 1.572411 0.42943
C  -2.440971 -1.175692 0.377549
C  -0.228789 2.289101 -0.981712
C  -0.791395 -2.306362 -1.022881
C  -2.654714 2.860897 0.347841
C  -3.312111 -2.279268 0.257315
C  -0.775849 3.589853 -1.040475
C  -1.643255 -3.42931 -1.117628
C  -1.986714 3.878194 -0.36944
C  -2.904362 -3.415289 -0.477781
H  2.017093 -0.75274 -1.053074
H  2.227826 0.95083 -0.540404
H  0.868836 -1.310867 1.076509
H  5.507412 -1.012694 -0.370688
H  4.119066 -1.677925 -1.282899
H  4.210963 1.618546 0.546827
H  3.535102 0.918381 2.050989
H  5.185686 0.447687 1.507966
H  4.557909 -1.965825 1.534889
H  2.946044 -1.476644 2.159212
H  3.063413 -2.506138 0.68762
H  1.662044 0.333458 2.756837
H  1.077307 1.710062 1.758459
H  -0.076278 0.566405 2.49525
H  5.363154 -0.025412 -2.650569
H  3.73407 0.607833 -2.359828
H  5.143186 1.264469 -1.45756
H  0.66647 2.046543 -1.564463
H  0.160495 -2.28737 -1.566249
H  -3.611893 3.065894 0.83811
H  -4.296535 -2.253153 0.735627
H  -0.277398 4.365819 -1.630489
H  -1.338021 -4.298652 -1.709059
H  -2.424374 4.87981 -0.424956
H  -3.576272 -4.274879 -0.563944
