program: Orca
programVersion: 5.0.2
elementType: S P O O O N N C C C C C C C C C C C C C H H H H H H H H H H H H H H H H H H H H H H H
charge: 0
multiplicity: 1
keywords: wb97x-d3
keywords: def2-TZVPP
keywords: def2/J RIJCOSX
keywords: DEFGRID2
keywords: scfconv7
keywords: smallprint printgap noloewdin
keywords: NOSOSCF
formula: C13H23N2O3PS
InChI: InChI=1/C13H23N2O3PS/c1-7-16-19(20,17-10(2)3)18-11-8-14-12(15-9-11)13(4,5)6/h8-10H,7H2,1-6H3
43 atoms
S  1.715673 -0.884281 1.722299
P  1.838448 -0.310619 -0.098017
O  2.109278 1.230298 -0.375593
O  0.522192 -0.537862 -1.014615
O  2.938296 -1.012382 -1.008839
N  -3.030351 -0.912943 -0.840734
N  -2.444936 0.957773 0.450176
C  -4.809833 0.34866 0.21894
C  -5.522179 0.604673 -1.115257
C  -5.022921 1.540396 1.147545
C  -5.384988 -0.91668 0.866007
C  -3.336535 0.125197 -0.064232
C  3.192567 1.919183 0.293617
C  -0.76129 -0.289715 -0.633128
C  -1.760505 -1.12077 -1.117744
C  -1.16548 0.759683 0.17234
C  3.996191 2.633008 -0.771873
C  2.60255 2.849963 1.33151
C  3.357515 -2.369029 -0.798255
C  4.692415 -2.402554 -0.093842
H  -5.139517 1.503409 -1.602528
H  -6.591394 0.748348 -0.949151
H  -5.395227 -0.232695 -1.800545
H  -4.63676 2.464491 0.718667
H  -6.090528 1.673982 1.331089
H  -4.531668 1.397285 2.10968
H  -5.261175 -1.784821 0.219967
H  -6.451189 -0.78697 1.060351
H  -4.898682 -1.13163 1.819189
H  3.831659 1.186873 0.799155
H  -1.512996 -1.965424 -1.753399
H  -0.457496 1.462724 0.597548
H  3.383109 3.361165 -1.30392
H  4.830438 3.165493 -0.314754
H  4.40141 1.928632 -1.497509
H  1.935421 3.579325 0.870176
H  3.397842 3.395558 1.839775
H  2.046578 2.290772 2.083624
H  2.609088 -2.919842 -0.224252
H  3.41803 -2.818859 -1.78926
H  5.446104 -1.840877 -0.645259
H  4.610642 -1.990284 0.911374
H  5.038672 -3.432736 -0.007433
totalener: -1584.17696023 hartree
nucrepener: 1987.84569953 hartree
electener: -3572.02265976 hartree
oneelecener: -6124.27320217 hartree
twoeener: 2552.25054240 hartree
kineticenergy: 1578.96548088 hartree
xcener: -118.046998862593 hartree
chargesum: 0.0000000
charge: -0.373487 0.677683 -0.323459 -0.309835 -0.319627 -0.339800 -0.301530 0.249800 -0.318067 -0.276081 -0.315539 0.219531 0.131413 0.231440 -0.029885 0.014707 -0.224722 -0.250832 0.031332 -0.232248 0.092726 0.083080 0.102172 0.088260 0.083472 0.090565 0.102416 0.082247 0.093618 0.054593 0.114368 0.096845 0.086207 0.079186 0.093325 0.089559 0.092982 0.097857 0.083626 0.096446 0.085513 0.084413 0.085728
qa: -0.3735 0.6777 -0.3235 -0.3098 -0.3196 -0.3398 -0.3015 0.2498 -0.3181 -0.2761 -0.3155 0.2195 0.1314 0.2314 -0.0299 0.0147 -0.2247 -0.2508 0.0313 -0.2322 0.0927 0.0831 0.1022 0.0883 0.0835 0.0906 0.1024 0.0822 0.0936 0.0546 0.1144 0.0968 0.0862 0.0792 0.0933 0.0896 0.0930 0.0979 0.0836 0.0964 0.0855 0.0844 0.0857
va: 2.0407 5.5582 2.1049 2.1591 2.1223 3.0684 3.1072 3.7231 3.9371 3.9310 3.9371 3.9637 3.8874 3.7169 4.1293 4.0849 3.9377 3.9111 3.8764 3.9150 1.0058 1.0057 1.0172 1.0167 1.0038 1.0155 1.0182 1.0054 1.0060 1.0150 1.0104 1.0218 1.0103 1.0084 1.0138 1.0066 1.0126 1.0202 1.0155 0.9950 1.0038 1.0197 1.0133
dispcorr: -0.020506516 hartree
energy: -1584.197466747190
dipole: -7.22858 8.67867 1.45009 8.25898 -8.19062 0.06836 2.05688 -2.54480 -0.48792
magnitude: 1.53150 au
magnitude: 3.89277 debye
